program: Gaussian 09
title: 000215087
version: EM64L-G09RevD.01
frameworkgroup: C1[X(C15H19N3O3)]
method: RPBEPBE
basis: SDD
operation: Freq
keyword: #p
keyword: freq=noraman
keyword: PBEPBE/SDD
title: #p freq=noraman PBEPBE/SDD
converged: NO YES NO NO
title: Mulliken charges:
elementType: O O O N N N C C C C C C C C C C C C C C C H H H H H H H H H H H H H H H H H H H
charge: -0.252672 -0.268702 -0.427555 -0.150939 -0.249361 -0.237074 -0.050286 -0.426639 -0.417203 -0.396049 -0.399797 -0.392132 0.241109 0.235182 0.433156 -0.301471 -0.362190 -0.355509 -0.211310 -0.216229 -0.247881 0.242571 0.256432 0.198146 0.209613 0.232808 0.207149 0.191906 0.194403 0.208515 0.202053 0.202452 0.231614 0.261684 0.274795 0.263475 0.232636 0.231978 0.377187 0.234135
chargesum: 0.00000
title: Mulliken charges with hydrogens summed into heavy atoms:
elementType: O O O N N N C C C C C C C C C C C C C C C
charge: -0.252672 -0.268702 -0.050368 -0.150939 -0.249361 -0.237074 0.192284 0.027939 0.025219 0.003007 0.003121 0.012373 0.241109 0.235182 0.433156 0.191826 -0.087395 -0.092035 0.021326 0.015750 -0.013746
polarizability: 2.01697287e+02 1.38725712e+01 2.26174869e+02 -2.36477169e+01 3.57646196e+00 1.39783107e+02
1716.lowfreq: -11.2805 -0.0008 -0.0005 -0.0004 6.0821 10.1372 34.4146 42.4549 52.6524
frequency: 33.9491 42.4326 52.6392 61.1496 73.5457 74.9252 103.7815 130.4833 173.0472 186.7983 196.3738 218.3851 237.1678 249.1350 269.2180 312.9803 332.1681 356.7231 372.1836 408.0365 414.9866 446.6877 453.7971 470.3129 498.4833 503.9713 521.7341 610.9094 623.3580 646.0161 661.9692 667.8183 694.7093 710.5618 752.7507 778.5668 787.8610 794.6419 840.3809 844.0282 854.4761 884.7761 895.0704 912.1182 921.3549 928.2546 966.7423 971.6630 987.0787 991.0021 992.7814 1013.6779 1023.8613 1044.3128 1058.9868 1074.4888 1077.9283 1083.9479 1109.8480 1118.3150 1140.6939 1159.6753 1174.3348 1187.4774 1194.3099 1213.8528 1248.7741 1259.5894 1269.6090 1284.2081 1306.4508 1309.6078 1321.3558 1329.7447 1332.8456 1338.1859 1339.9896 1342.5159 1347.5748 1359.8998 1377.0059 1389.2452 1414.2840 1446.4029 1463.4615 1464.1344 1464.7105 1467.3863 1473.9209 1484.8036 1485.1180 1592.5693 1608.8044 1641.4882 1689.3555 2965.2770 2969.2312 2977.1080 2985.7671 2995.3219 3001.6657 3007.9099 3033.6981 3036.2766 3043.5202 3053.4253 3067.6775 3121.5235 3133.1584 3143.3279 3156.6609 3168.6203 3185.7261 3521.6257
redmass: 5.7801 3.8412 4.6609 3.6994 4.5415 4.8456 4.2281 6.3106 8.3355 2.9965 4.6797 1.9906 2.9894 3.7816 6.1654 3.4775 2.9060 4.8992 5.5803 2.9379 4.2844 4.4024 3.2046 2.3147 2.9898 1.2005 2.8942 6.6958 7.0990 5.2977 7.1269 7.3394 2.3796 6.7595 2.0008 3.5484 1.4549 2.4735 1.4952 1.7922 4.8193 1.8897 1.6416 1.4948 1.6678 3.1429 2.6136 1.3880 5.5583 3.3939 1.3418 2.5809 2.3958 1.8657 1.1545 2.7431 1.3619 1.8311 2.7026 2.5342 3.6397 2.5712 1.0524 1.1556 1.8063 3.3697 1.3388 1.3078 1.3861 1.6681 1.5153 1.8958 1.4135 1.7736 1.3499 1.3764 1.8285 1.5389 1.5467 1.4554 1.9262 3.6391 1.3624 2.3351 1.0867 1.1022 1.0889 1.0848 1.0862 2.3312 1.1154 6.5157 6.0539 11.0998 11.0316 1.0643 1.0639 1.0618 1.0602 1.0627 1.0664 1.0845 1.0975 1.0946 1.1032 1.1035 1.1010 1.0995 1.0853 1.0892 1.0940 1.0990 1.0970 1.0657
irintensity: 1.8161 0.4222 0.7865 0.3365 0.1535 2.1252 1.4387 1.1882 5.2778 2.2165 3.1033 0.0724 0.4819 7.7153 9.2230 1.8178 11.7850 10.6958 3.7188 3.0642 14.4172 17.4025 2.1641 2.4656 32.4659 189.1032 40.5671 8.9848 66.5534 23.1584 16.6407 1.9269 20.8015 50.7901 36.0219 35.9293 1.3712 2.7727 12.6779 8.6521 12.6709 2.2776 18.7269 2.3258 0.6230 14.2855 125.6139 5.8066 0.0839 101.7173 0.5281 6.1741 5.7275 0.2665 1.8616 9.9088 2.4857 2.6407 0.3817 53.0928 24.5011 2.6966 0.0654 0.4123 13.5015 35.3448 9.2353 2.7900 0.8528 165.8776 2.2916 3.1677 42.7862 144.0127 1.1609 3.5748 70.3721 18.0522 18.6199 191.6873 3.9184 5.3811 64.0741 14.6016 3.7371 43.0959 9.1390 11.7988 15.9158 81.4338 21.1102 5.5833 45.5268 586.9449 181.2063 30.4699 32.1757 31.8560 20.8615 28.8808 53.4927 6.9323 63.5012 53.9991 25.3001 26.1117 43.2492 1.2858 1.0885 9.3740 22.2762 17.0915 1.8725 17.5541
temp: 298.150 k
press: 1.00000 atm
elementType: 8 8 8 7 7 7 6 6 6 6 6 6 6 6 6 6 6 6 6 6 6 1 1 1 1 1 1 1 1 1 1 1 1 1 1 1 1 1 1 1
symmnumber: 1
zpe: 855391.3 jmol-1
zpe.correction: 0.325801 hartree
zpe.thermalcorrener: 0.344721 hartree
zpe.thermalcorrenthalpy: 0.345665 hartree
zpe.thermalcorrgfe: 0.277790 hartree
zpe.sumelectzpe: -971.368408 hartree
zpe.sumelectthermal: -971.349488 hartree
zpe.sumelectthermalent: -971.348544 hartree
zpe.sumelectthermalfe: -971.416419 hartree
dipole: 0.8716 -4.5407 -0.1655
dipole: 4.6266
quadrupole: -124.2499 -126.4774 -122.4164
quadrupole: -1.1094 1.3599 -1.6662
quadrupole: 0.1313 -2.0961 1.9648 -1.1094 1.3599 -1.6662
hfenergy: -971.6942091 hartree
pointgroup: C01 [X(C15H19N3O3)]
dipole: -0.8394573 -1.6128614 -0.0851621 debye
polarizability: 224.8914667|15.079011|202.9496915|-15.5032478|18.1232465|139.8141049 unknown
InChI: InChI=1S/C15H19N3O3/c19-11-16-14(20)17(12-7-3-1-4-8-12)18(15(16)21)13-9-5-2-6-10-13/h1,3-4,7-8,13,19H,2,5-6,9-11H2
charge 0 multiplicity 1
40 atoms
O  2.754054 1.120905 -1.044868
O  -1.344967 2.925589 0.436841
O  1.298844 4.36929 0.87441
N  0.640323 0.122653 -0.504648
N  -0.581578 0.673813 0.042401
N  0.815255 2.366185 -0.395686
C  1.106646 -1.217384 -0.007004
C  1.875786 -1.960854 -1.123053
C  1.941647 -1.09977 1.292402
C  2.312887 -3.360618 -0.626209
C  2.378409 -2.504342 1.777321
C  3.149806 -3.264629 0.672358
C  1.548341 1.191291 -0.699346
C  -0.478353 2.081948 0.079335
C  -1.81268 -0.055845 -0.022935
C  1.336582 3.7443 -0.429344
C  -2.850381 0.268749 0.885764
C  -1.997149 -1.072811 -0.994041
C  -4.073673 -0.430076 0.813407
C  -3.220348 -1.774374 -1.040266
C  -4.26346 -1.458121 -0.139608
H  0.184801 -1.787364 0.217507
H  2.761152 -1.364404 -1.408367
H  1.234872 -2.048466 -2.021493
H  1.347711 -0.587679 2.074165
H  2.837684 -0.482204 1.089784
H  2.8930 -3.867311 -1.420528
H  1.415472 -3.986331 -0.436604
H  1.482564 -3.091104 2.069353
H  3.003216 -2.403566 2.684854
H  3.421091 -4.277791 1.025987
H  4.098224 -2.732159 0.456751
H  0.747898 4.31869 -1.170835
H  2.392383 3.679627 -0.730592
H  -2.700749 1.065987 1.617918
H  -1.203258 -1.288043 -1.71639
H  -4.87816 -0.173236 1.510798
H  -3.361516 -2.559195 -1.79139
H  0.346896 4.518381 1.119717
H  -5.212764 -2.002236 -0.182464
