program: Gaussian 09
title: 000215120
version: EM64L-G09RevD.01
frameworkgroup: C1[X(C22H25N3O3)]
method: RPBEPBE
basis: SDD
operation: Freq
keyword: #p
keyword: freq=noraman
keyword: PBEPBE/SDD
title: #p freq=noraman PBEPBE/SDD
converged: YES YES NO NO
title: Mulliken charges:
elementType: O O O N N N C C C C C C C C C C C C C C C C C C C C C C H H H H H H H H H H H H H H H H H H H H H H H H H
charge: -0.248697 -0.250075 -0.260112 -0.098623 -0.167192 -0.065671 -0.337013 -0.340345 -0.352932 -0.391354 -0.317181 -0.313647 -0.737108 0.237158 0.342585 0.219827 -0.057531 0.332707 -0.420840 -0.367929 -0.231291 -0.248604 -0.357490 -0.394811 -0.364833 -0.354174 0.316144 -0.537009 0.214606 0.232760 0.203964 0.194852 0.190071 0.218136 0.261499 0.229609 0.211102 0.193025 0.194007 0.212683 0.258307 0.259708 0.243860 0.267723 0.232706 0.233526 0.260848 0.262562 0.253483 0.241606 0.222988 0.224478 0.247933
chargesum: 0.00000
title: Mulliken charges with hydrogens summed into heavy atoms:
elementType: O O O N N N C C C C C C C C C C C C C C C C C C C C C C
charge: -0.248697 -0.250075 -0.260112 -0.098623 -0.167192 -0.065671 0.110353 0.058471 0.055274 0.099754 0.086947 0.093043 -0.219093 0.237158 0.342585 0.219827 -0.057531 0.332707 -0.176980 -0.100207 0.001415 -0.015078 -0.096642 -0.132249 -0.111350 -0.112568 0.316144 0.158391
polarizability: 3.40432713e+02 2.61950602e+01 3.59134384e+02 1.85154098e+01 9.54943797e+00 1.75687369e+02
1716.lowfreq: -6.7066 -4.3038 -0.0005 0.0006 0.0008 2.4190 13.7664 22.3514 30.5260
frequency: 13.1227 22.2701 30.4678 40.1251 51.0478 56.1924 67.8505 88.1855 95.2163 104.0216 113.7016 148.8642 163.8882 193.4612 203.6211 223.1472 230.3431 236.9276 242.5119 293.8091 303.6720 319.2822 335.1095 356.8263 361.1675 382.9724 398.5028 412.5462 415.3949 428.5680 437.4028 460.9176 469.0471 483.9406 506.6705 523.1327 542.3192 547.3581 586.4989 599.5734 622.2064 636.3482 651.9318 678.9754 703.2518 734.1050 744.2589 765.6636 766.6491 778.4855 790.6227 793.4746 811.5803 822.4340 828.0853 840.8249 843.8797 882.7833 896.0167 936.9097 942.5798 959.8145 965.2995 975.0369 977.7276 985.1555 994.8242 998.2873 1002.9079 1027.3960 1036.4008 1041.4032 1053.8133 1068.9145 1079.7463 1093.4942 1109.6385 1112.0597 1113.9101 1121.9486 1138.7053 1153.1174 1157.2151 1173.0966 1176.7700 1178.7342 1189.9658 1192.9387 1216.2895 1232.6670 1236.4156 1262.5514 1269.5137 1272.1717 1288.6121 1295.5004 1298.4327 1304.5655 1317.5069 1321.8990 1331.2328 1334.1288 1347.3266 1363.5279 1365.0220 1369.5011 1384.0385 1386.7043 1421.5265 1432.4945 1437.0222 1442.2252 1443.4912 1449.2366 1451.0529 1455.7191 1460.0884 1467.6974 1471.1759 1479.1496 1484.1049 1493.6679 1501.8973 1571.6131 1581.2992 1593.9566 1607.9785 1618.4642 2859.7791 2868.4308 2898.5272 2954.9803 2958.4045 2963.2925 2987.2212 3030.7679 3034.1635 3044.5367 3052.7611 3052.8442 3078.4752 3082.5565 3105.2755 3123.0433 3128.3253 3128.7166 3137.9071 3145.1880 3150.2290 3151.3634 3166.5747 3168.7682 3172.6258
redmass: 5.9351 4.6124 3.0411 4.2974 4.1585 4.6475 4.8276 3.7679 6.5419 4.0203 4.8146 4.1345 4.1972 3.7530 3.4344 2.3779 1.5770 1.9285 4.7016 3.5844 3.6761 2.8278 5.1510 3.1749 3.3859 4.5091 2.0954 2.9963 3.1141 5.5691 4.6772 3.9040 2.7890 4.5001 4.4141 3.0417 4.7684 5.8272 4.0357 2.2294 4.7809 5.8771 4.5352 5.7554 5.3506 3.1865 3.5356 2.0983 2.5421 2.4253 2.2070 3.4795 3.2772 1.3247 3.8950 1.6017 1.6490 1.4412 2.3767 2.8654 3.0487 1.4245 1.4732 1.3826 2.7236 8.5231 1.3303 2.7681 2.5904 2.2188 2.5688 3.4492 1.9710 2.3972 2.9667 2.5815 2.4228 1.2593 1.4976 2.0984 2.4849 1.7948 1.3514 1.6591 1.0900 1.3613 1.3013 1.6899 2.1506 1.6929 2.5893 1.9265 1.3268 1.3853 1.4366 1.3478 1.5081 1.3312 1.2964 2.9359 1.7206 1.2875 1.3106 1.7019 3.0889 1.2899 7.3814 1.3763 4.0958 2.2262 1.1929 1.0822 1.1132 1.0801 1.0988 1.1398 1.0993 1.0500 1.0752 2.6009 1.0951 5.9247 2.8186 7.1787 7.3202 8.3054 6.3869 6.4133 1.0705 1.0692 1.0689 1.0660 1.0662 1.0328 1.0666 1.0881 1.0909 1.0861 1.1029 1.0644 1.0966 1.0980 1.0957 1.1057 1.0857 1.0996 1.0894 1.0884 1.0872 1.0944 1.1007 1.0956 1.0966
irintensity: 0.1657 0.1097 0.0744 0.6854 0.0747 1.6726 1.7416 3.2018 2.2147 1.0452 2.5416 1.5271 8.0278 0.4909 1.6212 12.6128 1.6191 0.5015 3.2303 5.3638 9.5891 6.4548 11.5091 7.2745 4.7197 3.9561 1.3052 0.8403 0.3792 2.3853 9.4372 5.1830 1.2886 2.0640 7.7453 3.7808 3.6332 42.5551 6.8061 13.5776 1.6922 5.5189 13.1094 3.5784 12.0149 7.8378 7.9722 32.6177 3.6085 43.1757 13.2547 7.4117 23.8025 9.3586 10.6144 1.1702 55.6445 2.1034 6.9765 6.9135 29.3181 8.6834 1.2070 6.0621 29.9412 47.8206 0.1099 24.9127 7.6488 9.8891 14.8372 5.5389 16.3041 30.8696 10.0111 49.8163 1.5623 0.2209 14.8504 26.0916 92.6260 52.0385 13.9286 19.3478 39.3953 65.2278 5.4655 8.2555 12.7959 107.6147 130.9788 36.4338 7.8621 4.9058 77.6489 12.8793 9.3783 5.4486 4.4233 92.0955 65.3134 3.4348 3.3714 1.4597 24.8908 7.1201 1.9839 4.3074 1.1275 2.8803 10.4301 2.7938 32.4821 0.4438 11.9879 23.6171 7.5940 14.7532 63.8599 28.8744 11.2729 6.0794 65.6869 3.4506 87.1946 340.4954 21.0299 126.2862 46.7919 99.4658 82.7288 29.4098 108.3587 75.6197 9.8376 44.4711 26.4035 12.2426 35.1117 36.9906 38.2873 40.6445 6.3157 2.6980 0.7903 26.8188 6.1298 11.1572 6.4822 19.8833 23.7828 13.2832 5.5185
temp: 298.150 k
press: 1.00000 atm
elementType: 8 8 8 7 7 7 6 6 6 6 6 6 6 6 6 6 6 6 6 6 6 6 6 6 6 6 6 6 1 1 1 1 1 1 1 1 1 1 1 1 1 1 1 1 1 1 1 1 1 1 1 1 1
symmnumber: 1
zpe: 1133732.6 jmol-1
zpe.correction: 0.431816 hartree
zpe.thermalcorrener: 0.456924 hartree
zpe.thermalcorrenthalpy: 0.457869 hartree
zpe.thermalcorrgfe: 0.374236 hartree
zpe.sumelectzpe: -1241.163085 hartree
zpe.sumelectthermal: -1241.137977 hartree
zpe.sumelectthermalent: -1241.137033 hartree
zpe.sumelectthermalfe: -1241.220666 hartree
dipole: 3.9887 2.3302 0.5149
dipole: 4.6481
quadrupole: -175.5327 -149.9741 -161.6529
quadrupole: 0.4502 5.5081 3.6761
quadrupole: -13.1462 12.4125 0.7337 0.4502 5.5081 3.6761
hfenergy: -1241.5949013 hartree
pointgroup: C01 [X(C22H25N3O3)]
dipole: 1.5498878 -0.9278608 -0.2847331 debye
polarizability: 338.9108193|-24.3661038|358.0821508|-22.4947817|21.4289585|178.2614951 unknown
InChI: InChI=1S/C22H25N3O3/c1-27-19-8-6-17(7-9-19)22-20-5-3-2-4-18(20)16-21(26)25(23-22)11-10-24-12-14-28-15-13-24/h2-9H,10-16H2,1H3
charge 0 multiplicity 1
53 atoms
O  -6.629163 -2.032517 -0.432093
O  -1.802303 3.372517 0.932363
O  4.270621 -4.465629 0.088899
N  -4.373726 -0.26575 0.037122
N  -0.939313 1.373732 0.094474
N  -0.050376 0.277455 0.122115
C  -3.127119 0.26133 0.635049
C  -4.194207 -1.583911 -0.621785
C  -5.521443 -0.311657 0.978088
C  -2.276457 0.995279 -0.429704
C  -5.484617 -1.982438 -1.356993
C  -6.79533 -0.721421 0.220209
C  0.501708 2.76053 1.567138
C  -0.836196 2.558739 0.850828
C  1.61157 2.877284 0.544322
C  1.991479 1.716045 -0.190376
C  1.27179 0.426296 -0.001001
C  2.037838 -0.854986 -0.008499
C  2.257394 4.110484 0.290571
C  3.027349 1.818837 -1.162195
C  3.278695 4.202486 -0.678409
C  3.662476 3.051411 -1.408904
C  3.401472 -0.902182 0.404046
C  1.413798 -2.072736 -0.38858
C  4.112031 -2.113241 0.426898
C  2.114223 -3.294004 -0.376243
C  3.473323 -3.316363 0.034149
C  3.655822 -5.741843 -0.290095
H  -2.507101 -0.54222 1.099991
H  -3.390135 0.98541 1.427043
H  -3.363161 -1.523927 -1.349268
H  -3.936481 -2.377531 0.125176
H  -5.346568 -1.036717 1.812707
H  -5.664217 0.692512 1.419229
H  -2.788035 1.920718 -0.735166
H  -2.116244 0.358314 -1.314041
H  -5.405781 -2.997018 -1.78198
H  -5.688802 -1.250189 -2.167796
H  -7.033539 0.04897 -0.544551
H  -7.648853 -0.84092 0.907924
H  0.68075 1.899806 2.241809
H  0.40965 3.672499 2.17564
H  1.955224 4.998483 0.85726
H  3.313426 0.931318 -1.735904
H  3.773522 5.16215 -0.863641
H  4.448181 3.118398 -2.169069
H  3.903813 0.01611 0.724833
H  0.363212 -2.044818 -0.692437
H  5.156051 -2.155564 0.751194
H  1.603346 -4.210756 -0.685557
H  3.319083 -5.728062 -1.344754
H  2.802262 -5.988065 0.370568
H  4.451154 -6.490648 -0.164204
