program: Gaussian 09
title: 000215161
version: EM64L-G09RevD.01
frameworkgroup: C1[X(C22H31NO2)]
method: RPBEPBE
basis: SDD
operation: Freq
keyword: #p
keyword: freq=noraman
keyword: PBEPBE/SDD
title: #p freq=noraman PBEPBE/SDD
converged: YES YES NO NO
title: Mulliken charges:
elementType: O O N C C C C C C C C C C C C C C C C C C C C C C H H H H H H H H H H H H H H H H H H H H H H H H H H H H H H H
charge: -0.314826 -0.457424 -0.334256 -0.016047 -0.630396 -0.568152 -0.067805 -0.327101 -0.371468 -0.024643 -0.420350 0.498533 0.484557 -0.697021 -0.691933 -0.404467 -0.386801 -0.413459 -0.438337 -0.232900 -0.230114 -0.236526 -0.236870 -0.246804 -0.246892 0.217392 0.241959 0.227275 0.218116 0.232720 0.201853 0.227698 0.218639 0.187149 0.190564 0.181492 0.197134 0.207936 0.316667 0.212774 0.214331 0.208186 0.204931 0.212071 0.211702 0.233224 0.274105 0.250318 0.233437 0.338705 0.223569 0.222575 0.226745 0.224873 0.227419 0.225940
chargesum: 0.00000
title: Mulliken charges with hydrogens summed into heavy atoms:
elementType: O O N C C C C C C C C C C C C C C C C C C C C C C
charge: -0.314826 -0.118719 -0.017589 0.201345 -0.161162 -0.117316 0.134048 0.119235 0.006246 0.156850 -0.015279 0.498533 0.484557 -0.061730 -0.063228 -0.171242 -0.112695 -0.163141 -0.204900 -0.009331 -0.007539 -0.009781 -0.011997 -0.019385 -0.020951
polarizability: 2.84713339e+02 5.33924210e+00 2.58316967e+02 2.31498526e+01 -2.61175596e+01 1.89996557e+02
1716.lowfreq: -22.9806 -9.9656 -8.4121 -6.8116 -0.0005 0.0002 0.0004 6.3720 16.2147
frequency: -21.8124 -5.3655 16.1707 19.8661 25.0620 33.7165 43.2861 51.6223 69.5918 80.7774 93.6019 101.4090 126.4326 161.8160 188.3268 196.8513 224.8200 244.5910 246.6618 256.2410 271.5569 285.2517 288.0905 307.2568 331.9815 351.8775 362.6465 380.6735 385.0841 404.2431 406.1277 426.4646 440.9492 457.1522 479.0081 500.5838 530.9004 576.6499 586.4123 616.7502 617.8052 643.3576 656.2631 706.0345 708.2354 736.4451 753.7984 765.1429 774.2056 800.6453 832.2401 854.7231 860.8890 863.7031 876.1809 888.0051 908.9700 919.3022 920.9832 926.4345 944.2970 952.6380 961.9667 972.9419 976.8093 981.5820 990.2626 990.5141 992.8271 994.9182 997.7579 1011.5522 1014.6817 1027.2378 1029.4084 1061.5405 1076.9887 1080.7450 1081.4517 1099.7366 1114.1390 1147.2819 1156.7011 1170.1748 1171.7531 1173.7365 1188.0772 1189.8653 1190.7674 1196.7695 1207.6867 1213.2816 1214.4461 1224.8750 1252.2693 1268.8156 1285.2603 1290.1719 1297.4877 1299.3492 1321.2196 1329.2263 1331.4445 1336.2661 1351.6105 1359.0073 1362.0325 1370.7676 1376.5378 1380.0360 1381.6135 1394.1171 1397.5074 1436.5974 1440.7559 1448.0650 1451.6268 1461.4439 1464.7188 1468.0032 1476.3292 1480.9202 1482.3927 1483.1436 1484.9024 1487.1788 1492.1354 1588.9058 1591.6295 1613.0203 1614.1054 2876.6994 2938.6071 2950.1086 2953.6061 2956.8496 2965.3011 2968.5871 2971.6637 2973.6490 2986.2433 2997.9293 3011.9854 3032.1068 3056.9258 3062.6747 3065.4640 3068.2428 3068.8766 3072.6570 3111.1690 3113.0861 3121.4445 3123.1157 3133.5379 3136.5582 3143.6242 3153.5709 3161.3244 3165.5778 3466.2284 3565.3196
redmass: 2.9575 4.6947 4.4834 4.3271 4.6365 4.2220 3.4381 4.0822 4.2082 2.9402 3.9431 3.9471 4.2529 2.8816 3.8570 2.8790 1.6056 3.0200 1.3933 2.9941 1.5218 1.5093 2.5376 2.9935 2.7250 2.3346 2.1147 3.4192 2.0563 2.8295 2.8550 2.6720 2.1605 2.8789 4.3352 4.2158 3.5027 1.8905 4.5037 6.2311 6.2518 2.7627 1.6709 1.8376 1.9449 2.3013 1.7815 3.1669 2.7294 3.4649 2.6162 1.2559 1.2580 1.8819 2.3145 1.9864 1.4462 1.2578 1.4468 1.5087 1.9261 2.1354 1.6078 3.8717 1.4038 1.4034 5.2034 5.2040 2.0107 1.4083 1.6050 3.1558 2.4033 2.2129 2.1602 2.0746 1.6983 1.6543 1.7149 2.1319 1.7779 1.8903 1.2487 1.0575 1.0567 2.2315 1.1231 1.1373 1.3914 2.0553 1.7576 1.4132 2.4297 1.3725 1.1574 1.2361 1.2282 1.5285 1.4375 1.3859 1.2686 1.2812 1.3338 1.3248 1.3504 1.3303 1.3582 1.4705 1.2471 4.3635 7.1325 1.2753 1.4624 1.7649 2.1570 1.0810 1.2524 1.1228 1.0800 1.1244 1.1317 1.1911 1.0662 2.2242 1.8548 1.0678 1.0596 5.9970 6.0164 6.0728 6.0871 1.0659 1.0704 1.0809 1.0845 1.0730 1.0360 1.0880 1.0381 1.0680 1.0611 1.0611 1.1005 1.0958 1.0990 1.0997 1.1011 1.0989 1.1039 1.0990 1.0871 1.0861 1.0859 1.0872 1.0915 1.0932 1.0960 1.0966 1.1014 1.0985 1.0758 1.0663
irintensity: 0.1374 0.0440 0.0093 0.1172 0.0256 0.1446 0.6343 0.0500 0.2882 0.3983 0.4559 0.9795 4.2348 2.0831 0.1077 0.2032 0.8801 0.9247 1.6542 6.0550 26.0562 81.4583 42.5524 2.5450 7.8565 6.6839 0.2383 2.2993 5.8490 0.0065 0.3884 25.0636 15.6231 6.8935 6.1136 27.5713 13.9056 71.0793 3.7676 0.1531 0.3812 45.7019 123.6581 95.0968 10.0518 2.9248 76.1412 15.8008 5.5872 3.2408 12.8996 0.3516 0.3028 15.5842 3.3036 5.0902 0.7399 3.7558 4.2785 4.0231 16.9557 1.7938 1.2192 104.8333 0.7170 0.1923 0.1862 0.9393 15.0493 4.9528 13.6688 71.9967 68.8866 5.9572 16.2685 4.9209 14.2204 24.4948 21.5056 7.1603 20.2686 21.1212 2.3164 0.2676 0.1404 7.5017 1.0391 1.8617 12.0993 25.2681 4.5937 12.7785 0.9475 12.8615 11.8496 3.7895 1.1992 15.7410 0.7124 8.0945 4.3082 0.7347 14.0320 4.2868 10.0448 3.2031 9.2296 16.1093 21.0480 4.1033 1.1443 12.3393 6.5767 4.4967 7.8214 5.2740 20.6001 8.0983 16.6255 21.1106 15.6683 19.3324 19.1221 23.1824 18.2915 7.8917 17.5176 0.7306 0.8145 10.2843 7.3475 87.6926 10.0119 38.5768 30.4146 113.4202 38.5801 66.5073 27.4032 38.8317 40.8871 12.8910 42.3715 22.5146 32.4198 25.9390 13.7858 62.6076 46.6074 72.9897 9.6030 10.4012 0.9579 2.6355 19.1995 33.0328 37.4748 26.1636 25.3772 14.9766 53.6558 4.9008
temp: 298.150 k
press: 1.00000 atm
elementType: 8 8 7 6 6 6 6 6 6 6 6 6 6 6 6 6 6 6 6 6 6 6 6 6 6 1 1 1 1 1 1 1 1 1 1 1 1 1 1 1 1 1 1 1 1 1 1 1 1 1 1 1 1 1 1 1
symmnumber: 1
zpe: 1262698.0 jmol-1
zpe.correction: 0.480936 hartree
zpe.thermalcorrener: 0.505466 hartree
zpe.thermalcorrenthalpy: 0.506411 hartree
zpe.thermalcorrgfe: 0.423978 hartree
zpe.sumelectzpe: -1060.201641 hartree
zpe.sumelectthermal: -1060.177111 hartree
zpe.sumelectthermalent: -1060.176167 hartree
zpe.sumelectthermalfe: -1060.258599 hartree
dipole: 0.6895 -1.3111 -0.2766
dipole: 1.5069
quadrupole: -136.7807 -145.2475 -158.7474
quadrupole: -2.5246 1.0837 -8.6303
quadrupole: 10.1445 1.6777 -11.8222 -2.5246 1.0837 -8.6303
hfenergy: -1060.6825773 hartree
pointgroup: C01 [X(C22H31N1O2)]
dipole: 0.3446179 0.4823953 -0.005665 debye
polarizability: 264.3740828|-20.0892984|265.1782295|18.520898|40.4529589|203.4745511 unknown
InChI: InChI=1S/C22H31NO2/c1-18(2)15-23-16-21(24)17-25-22(13-19-9-5-3-6-10-19)14-20-11-7-4-8-12-20/h3-12,18,21-24H,13-17H2,1-2H3
charge 0 multiplicity 1
56 atoms
O  -0.867286 0.263498 0.848487
O  -0.907657 2.61565 3.714256
N  -0.592454 3.061179 -0.025279
C  0.400579 -0.516739 0.897284
C  1.066982 -0.35833 -0.490077
C  0.131312 -1.981891 1.334557
C  -0.564253 2.262278 2.322712
C  -1.233741 0.885015 2.132344
C  -1.075417 3.336398 1.333909
C  -2.040815 4.165411 -1.882646
C  -0.708771 4.095495 -1.066416
C  2.477574 -0.932604 -0.530115
C  -0.636277 -2.86113 0.352907
C  -2.297251 2.844176 -2.646603
C  -3.264105 4.550016 -1.017904
C  3.543534 -0.253836 0.118629
C  -1.891155 -2.463206 -0.18292
C  2.76172 -2.150433 -1.19949
C  -0.118561 -4.129688 -0.017667
C  4.854395 -0.779489 0.106194
C  -2.601322 -3.310009 -1.063094
C  4.07302 -2.678964 -1.2168
C  -0.830355 -4.981882 -0.893041
C  5.124092 -1.997579 -0.561225
C  -2.076788 -4.574078 -1.420937
H  1.062627 -0.055609 1.6622
H  0.425887 -0.838562 -1.250578
H  1.092957 0.726631 -0.706485
H  -0.412625 -1.940083 2.301119
H  1.111616 -2.44705 1.55238
H  0.53629 2.170159 2.195114
H  -2.331198 1.007836 2.114386
H  -0.96704 0.232087 2.987006
H  -0.6719 4.324448 1.646796
H  -2.185427 3.396053 1.449996
H  -1.888141 4.969849 -2.636073
H  -0.529475 5.078668 -0.585699
H  0.114997 3.945239 -1.796317
H  -0.790546 2.100077 -0.327388
H  -1.442175 2.582651 -3.298633
H  -3.198581 2.921386 -3.282455
H  -2.459922 2.00437 -1.943067
H  -3.075899 5.473192 -0.43752
H  -4.154839 4.722261 -1.651053
H  -3.514596 3.74303 -0.305225
H  3.345637 0.701132 0.622716
H  -2.292747 -1.482426 0.089922
H  1.951086 -2.682966 -1.710869
H  0.848965 -4.452828 0.38736
H  -0.573205 3.527482 3.907828
H  5.665208 -0.238898 0.608103
H  -3.567313 -2.9853 -1.467375
H  4.274274 -3.618432 -1.74439
H  -0.413516 -5.959758 -1.160717
H  6.14111 -2.405454 -0.575714
H  -2.631807 -5.232144 -2.099227
