program: Gaussian 09
title: 000215084
version: EM64L-G09RevD.01
frameworkgroup: C1[X(C16H15N3O2)]
method: RPBEPBE
basis: SDD
operation: Freq
keyword: #p
keyword: freq=noraman
keyword: PBEPBE/SDD
title: #p freq=noraman PBEPBE/SDD
converged: YES YES NO NO
title: Mulliken charges:
elementType: O O N N N C C C C C C C C C C C C C C C C H H H H H H H H H H H H H H H
charge: -0.258227 -0.232746 -0.117053 -0.250841 -0.437012 -0.277802 0.509282 -0.710268 0.241447 0.448553 0.209804 -0.410461 -0.351607 -0.360623 -0.357480 -0.232828 -0.251799 -0.237745 -0.213511 -0.213705 -0.248279 0.261525 0.225137 0.219136 0.265688 0.360540 0.233706 0.257739 0.277314 0.264672 0.228909 0.229346 0.231045 0.232609 0.231752 0.233785
chargesum: 0.00000
title: Mulliken charges with hydrogens summed into heavy atoms:
elementType: O O N N N C C C C C C C C C C C C C C C C
charge: -0.258227 -0.232746 -0.117053 -0.250841 -0.076473 -0.016277 0.509282 -0.000307 0.241447 0.448553 0.209804 -0.176754 -0.093868 -0.083309 -0.092808 -0.003919 -0.022454 -0.006700 0.019098 0.018046 -0.014494
polarizability: 2.31046816e+02 -3.69024145e+01 1.68198391e+02 6.89602870e+00 1.24226643e+01 1.75385619e+02
1716.lowfreq: -5.3550 -0.0008 -0.0006 0.0003 7.4904 9.8467 23.5677 30.9720 42.0876
frequency: 23.3476 30.9482 42.0656 60.7233 82.3688 90.7943 127.7725 183.9930 187.7540 207.3898 217.9218 245.3865 256.2969 275.3089 320.5494 352.8476 388.1080 403.6402 407.6527 420.4771 446.4936 499.9322 538.0291 583.1668 591.5358 611.7252 615.7688 622.5718 638.3161 666.0052 678.9580 696.5285 701.3440 704.4483 725.6051 761.7205 764.8569 786.4181 842.6454 851.3894 854.7905 914.5740 925.8307 970.6423 977.1455 978.8594 986.6902 991.4270 992.8848 997.4841 999.5644 1021.5770 1031.2536 1044.4375 1065.4803 1079.1028 1100.2196 1105.9344 1133.6522 1173.3943 1174.0958 1176.4089 1186.7635 1195.5372 1219.1997 1281.7809 1299.1474 1306.2462 1320.1696 1331.8773 1348.6293 1367.6487 1385.1633 1389.4454 1395.4033 1444.4377 1446.2348 1460.6171 1484.2790 1484.5209 1493.3482 1591.8051 1592.9923 1608.8087 1612.4645 1677.1759 1701.2976 3001.2514 3032.6331 3093.5265 3116.0829 3123.1827 3128.6647 3132.7179 3142.3393 3142.7937 3155.2519 3157.1863 3168.1463 3168.5915 3186.0807 3617.3481
redmass: 4.7563 5.0662 5.8544 4.0057 5.3162 6.1412 5.0729 4.5095 9.7872 5.0326 3.4539 1.0462 4.0904 4.5125 6.2817 6.2383 8.3797 2.8042 2.9348 5.2310 5.4544 3.4824 3.5455 4.1474 3.9677 6.3118 4.7534 1.4786 6.4430 9.8760 4.3888 3.0877 2.7632 1.7800 4.9188 2.9031 1.8614 2.1581 1.2530 4.2909 1.3423 1.3982 1.4273 1.4491 1.8972 1.5004 5.2814 4.7593 1.3593 3.7994 1.4496 2.4357 1.9910 1.6931 2.4582 1.8019 3.9057 2.3372 2.6013 1.3648 1.2133 1.7128 1.1630 1.1230 2.3986 4.1494 1.5723 1.7802 1.4702 3.0895 1.3714 1.8948 7.4842 2.4543 1.3849 2.2122 2.2063 1.0553 2.2090 2.3127 1.0764 6.5087 5.9037 6.0379 5.9561 7.6974 12.0605 1.0369 1.0846 1.0999 1.0878 1.0990 1.0871 1.0853 1.0923 1.0891 1.0942 1.0962 1.0990 1.0996 1.0970 1.0811
irintensity: 0.2658 0.0126 0.5496 1.0510 0.2842 0.3781 1.0165 0.2916 10.0102 0.9188 0.3264 0.0251 3.3819 4.5980 6.5451 4.0093 8.2636 0.1621 1.5446 2.5759 8.2786 13.0416 29.8296 39.9024 28.2258 0.7351 6.3988 55.7645 20.5296 9.3424 13.9640 47.6033 46.7101 31.0720 29.8900 13.4860 72.4833 18.5892 0.8719 2.7148 0.2875 5.8063 2.9148 0.8670 8.0561 0.1312 0.6371 0.7979 0.4004 21.7533 1.6691 22.3510 9.3636 11.6362 5.4331 11.0437 41.8784 17.0387 2.0374 9.6572 6.0921 18.1914 0.2855 0.2998 22.6560 124.0307 15.3009 69.6398 38.9531 214.4576 3.3424 7.6183 2.0197 14.7639 21.6843 4.6056 19.7440 14.0946 71.6918 44.8407 8.6860 4.2749 2.0992 50.2615 1.0863 658.5497 214.7448 21.1442 6.4088 32.3348 7.3571 6.8529 1.7634 1.6703 23.2879 9.1511 20.8828 24.1806 20.5683 10.8368 1.6847 103.6901
temp: 298.150 k
press: 1.00000 atm
elementType: 8 8 7 7 7 6 6 6 6 6 6 6 6 6 6 6 6 6 6 6 6 1 1 1 1 1 1 1 1 1 1 1 1 1 1 1
symmnumber: 1
zpe: 737731.3 jmol-1
zpe.correction: 0.280987 hartree
zpe.thermalcorrener: 0.298747 hartree
zpe.thermalcorrenthalpy: 0.299691 hartree
zpe.thermalcorrgfe: 0.233824 hartree
zpe.sumelectzpe: -931.933179 hartree
zpe.sumelectthermal: -931.915419 hartree
zpe.sumelectthermalent: -931.914475 hartree
zpe.sumelectthermalfe: -931.980342 hartree
dipole: 0.3378 -2.7981 1.4801
dipole: 3.1834
quadrupole: -116.1177 -121.9627 -121.4600
quadrupole: -3.8293 10.7482 2.4964
quadrupole: 3.7291 -2.1159 -1.6132 -3.8293 10.7482 2.4964
hfenergy: -932.2141663 hartree
pointgroup: C01 [X(C16H15N3O2)]
dipole: 0.0873945 -1.1895379 0.3820824 debye
polarizability: 228.6748448|-39.7331458|166.4262133|1.8946121|9.3633788|179.5297673 unknown
InChI: InChI=1S/C16H15N3O2/c1-12(13-8-4-2-5-9-13)18-15(20)17-16(21)19(18)14-10-6-3-7-11-14/h2-12,17H,1H3
charge 0 multiplicity 1
36 atoms
O  -1.874751 2.59201 1.12959
O  1.578857 2.121775 -2.066812
N  -0.131753 0.963503 0.836987
N  0.858363 0.786757 -0.203156
N  -0.233169 2.686764 -0.603642
C  -0.833392 -0.286083 1.343678
C  -1.87807 -0.791389 0.343857
C  -1.35496 -0.030436 2.770399
C  -0.864529 2.143489 0.5339
C  1.997658 -0.053098 0.010065
C  0.821988 1.889352 -1.095963
C  -1.510357 -1.799227 -0.584257
C  -3.198179 -0.270309 0.303976
C  2.68049 -0.582339 -1.113656
C  2.443875 -0.341425 1.325345
C  -2.43855 -2.282269 -1.533403
C  -4.126177 -0.752407 -0.645083
C  -3.751498 -1.759172 -1.565502
C  3.813519 -1.397795 -0.910448
C  3.567012 -1.175169 1.510744
C  4.257281 -1.706623 0.396966
H  -0.029776 -1.041224 1.403905
H  -1.813088 -0.956186 3.159982
H  -0.522252 0.259795 3.435135
H  -2.102372 0.776835 2.794274
H  -0.526213 3.556994 -1.04361
H  -0.492633 -2.209751 -0.561563
H  -3.496897 0.515991 1.00428
H  2.335509 -0.338929 -2.121514
H  1.933213 0.107548 2.183551
H  -2.140226 -3.063536 -2.241273
H  -5.142022 -0.342274 -0.666354
H  -4.475411 -2.132424 -2.298607
H  4.346441 -1.798762 -1.7793
H  3.91021 -1.396186 2.527316
H  5.131858 -2.348696 0.545289
