program: Gaussian 09
title: 000215028
version: EM64L-G09RevD.01
frameworkgroup: C1[X(C18H19ClN2S)]
method: RPBEPBE
basis: SDD
operation: Freq
keyword: #p
keyword: freq=noraman
keyword: PBEPBE/SDD
title: #p freq=noraman PBEPBE/SDD
converged: YES YES NO NO
title: Mulliken charges:
elementType: Cl S N N C C C C C C C C C C C C C C C C C C H H H H H H H H H H H H H H H H H H H
charge: -0.061314 0.157618 -0.107160 -0.291554 -0.170997 -0.325541 -0.319137 -0.630983 0.604292 -0.436166 -0.438226 0.629595 -0.375222 -0.320229 -0.429623 -0.428504 -0.245375 -0.106333 -0.278365 -0.240830 -0.249154 -0.243998 0.200042 0.189204 0.225350 0.223700 0.190327 0.231484 0.250722 0.198775 0.205545 0.206656 0.197502 0.267122 0.267402 0.230127 0.257267 0.245014 0.259663 0.229916 0.231391
chargesum: 0.00000
title: Mulliken charges with hydrogens summed into heavy atoms:
elementType: Cl S N N C C C C C C C C C C C C C C C C C C
charge: -0.061314 0.157618 -0.107160 -0.024432 0.029045 0.089013 0.094890 -0.148778 0.604292 -0.031846 -0.034068 0.629595 -0.375222 -0.320229 -0.162221 -0.198377 0.011892 -0.106333 -0.033352 0.018833 -0.019238 -0.012607
polarizability: 3.32864679e+02 2.24814544e+01 1.77956624e+02 -5.12711230e+00 2.17164540e+01 1.92213917e+02
1716.lowfreq: -7.3735 -0.0029 -0.0026 -0.0020 8.0726 11.9874 21.1999 37.2597 47.6884
frequency: 21.1297 37.0787 47.3453 66.2716 82.9221 99.6017 143.9462 148.5593 191.4114 207.0339 230.2727 239.2938 252.7776 286.2226 291.2873 295.0690 309.3189 361.8821 377.4313 396.3945 414.3295 438.1250 444.4154 457.3460 476.1885 499.8435 506.9049 527.5727 575.1142 592.0837 616.4324 649.4659 668.2166 688.0924 696.6979 716.9950 741.1062 755.3482 763.3206 818.8196 822.7077 844.3669 847.6023 868.2546 887.7928 893.1906 924.0466 940.2173 951.2927 959.7098 979.8314 992.4090 1026.3970 1032.0342 1036.8324 1052.5738 1060.5335 1068.4882 1090.3594 1099.3594 1122.4801 1125.4342 1126.9909 1137.0871 1165.2660 1174.5026 1183.5856 1198.9002 1208.3572 1230.3079 1232.0494 1251.0743 1258.1070 1267.2822 1295.8533 1302.5936 1321.5927 1328.4057 1343.0346 1359.6773 1366.4511 1377.3697 1382.3245 1387.9570 1401.2055 1420.1484 1442.2819 1449.2257 1454.4791 1456.3166 1462.1946 1465.3708 1469.2792 1480.5687 1567.1222 1578.9854 1586.0366 1600.1059 2804.3905 2853.5060 2866.8443 2884.6501 2890.0456 2986.3051 3035.5288 3036.2488 3039.6928 3057.4992 3063.5000 3112.3482 3125.8303 3142.7912 3144.0438 3147.4779 3164.4467 3175.4660 3453.5635
redmass: 7.6887 5.0717 3.0188 5.3197 6.2391 4.1667 4.1689 8.0747 4.4540 5.3277 5.3097 3.8356 2.5618 3.2026 3.1598 3.2603 5.9069 4.2073 6.2401 2.3123 4.0770 3.6432 3.3431 2.9667 3.6838 4.1418 3.9581 2.3349 5.5534 3.1779 5.5401 6.2476 4.6983 3.2714 1.9092 4.0764 2.6868 1.4714 4.6825 1.3912 4.0444 2.4630 1.4972 1.7023 2.6426 1.5481 2.3533 1.5307 1.3503 1.9751 1.3316 3.1610 6.3009 2.7953 4.9060 1.7806 2.2221 1.8654 2.0118 2.2551 1.8696 2.3196 1.9365 2.4048 2.9860 1.1343 1.4765 1.1214 1.9132 1.4490 1.3419 1.3315 1.5412 1.3043 1.2913 1.2581 1.2646 1.5227 1.3511 1.9520 5.0822 2.9687 1.7603 1.4624 2.2137 2.0065 1.3505 1.0908 2.2586 1.0785 1.1139 1.5395 1.1341 1.4719 6.8490 6.4355 7.5665 6.3377 1.0807 1.0709 1.0699 1.0704 1.0683 1.0625 1.0908 1.0979 1.0919 1.0879 1.0877 1.0877 1.0877 1.0928 1.0894 1.0919 1.1008 1.0964 1.0752
irintensity: 0.0901 0.0774 0.0916 0.1073 0.8725 0.7503 2.0448 1.5343 0.2645 0.8844 0.2368 0.7399 1.1612 2.0578 2.2736 2.0411 0.3803 1.3626 3.9911 0.1498 4.2021 7.3543 2.5342 1.5567 27.8882 19.2515 8.4487 36.4411 10.4669 18.2947 1.2649 17.0428 5.9806 12.9015 74.3847 1.5012 32.1086 54.0555 14.1791 42.8464 24.1729 7.4276 0.3380 1.8984 5.3434 22.1856 1.9395 4.6018 0.0535 4.6333 0.1230 30.9034 62.8546 15.5506 28.1324 0.5065 6.4470 9.9834 33.4313 6.3882 5.0788 28.2037 17.0275 26.0689 17.2562 1.6233 5.8804 0.6000 5.9884 11.5122 1.6365 4.0483 17.9745 4.2664 9.4553 4.2184 36.9308 11.1064 0.8659 1.7897 5.5024 2.3894 3.3273 3.3386 12.6319 15.5522 3.5473 5.6810 117.0625 0.5854 11.5778 2.9660 6.0808 42.2589 4.5391 26.9458 2.7698 5.8827 65.0381 68.1011 63.6164 28.5650 181.9078 21.5038 60.1531 9.4039 49.3943 34.9961 19.7089 10.1082 1.7796 18.3865 3.0051 0.5677 34.2874 3.6556 2.1367
temp: 298.150 k
press: 1.00000 atm
elementType: 17 16 7 7 6 6 6 6 6 6 6 6 6 6 6 6 6 6 6 6 6 6 1 1 1 1 1 1 1 1 1 1 1 1 1 1 1 1 1 1 1
symmnumber: 1
zpe: 864145.5 jmol-1
zpe.correction: 0.329136 hartree
zpe.thermalcorrener: 0.348208 hartree
zpe.thermalcorrenthalpy: 0.349152 hartree
zpe.thermalcorrgfe: 0.280818 hartree
zpe.sumelectzpe: -1663.313997 hartree
zpe.sumelectthermal: -1663.294925 hartree
zpe.sumelectthermalent: -1663.293981 hartree
zpe.sumelectthermalfe: -1663.362315 hartree
dipole: -2.3173 0.1722 0.1682
dipole: 2.3297
quadrupole: -142.6670 -145.1435 -135.5247
quadrupole: -2.3240 -4.6785 0.5816
quadrupole: -1.5553 -4.0318 5.5870 -2.3240 -4.6785 0.5816
hfenergy: -1663.6431329 hartree
pointgroup: C01 [X(C18H19Cl1N2S1)]
dipole: 0.8452465 0.3544915 -0.0055917 debye
polarizability: 329.1225927|31.5419097|177.9923684|13.346689|-18.5269399|195.9202594 unknown
InChI: InChI=1S/C18H19ClN2S/c19-14-5-6-18-15(12-14)16(21-9-7-20-8-10-21)11-13-3-1-2-4-17(13)22-18/h1-6,12,16,20H,7-11H2
charge 0 multiplicity 1
41 atoms
Cl -5.355317 -1.903964 -1.164792
S  0.356712 -1.141484 1.735378
N  -0.144651 1.497022 -0.288777
N  0.021075 4.265106 0.501477
C  -0.543674 0.3391 -1.132249
C  0.719437 2.461564 -1.02286
C  -1.309516 2.20411 0.311836
C  0.69121 -0.46539 -1.659012
C  -1.514607 -0.599434 -0.418183
C  1.195978 3.582081 -0.081605
C  -0.828361 3.317676 1.256563
C  1.888742 -0.617955 -0.728817
C  -1.177466 -1.331694 0.751349
C  1.835268 -0.928471 0.656057
C  -2.794548 -0.802691 -0.992159
C  3.17921 -0.476278 -1.312747
C  -2.117248 -2.220163 1.333331
C  -3.714376 -1.683602 -0.397398
C  3.031654 -1.078452 1.40802
C  -3.398628 -2.399147 0.771303
C  4.370685 -0.628653 -0.576639
C  4.293527 -0.929442 0.801994
H  -1.08417 0.699648 -2.048818
H  0.166823 2.921334 -1.882124
H  1.604566 1.934171 -1.415985
H  -1.913815 1.480283 0.884589
H  -1.960381 2.657028 -0.47828
H  1.051951 0.01083 -2.589191
H  0.31872 -1.464044 -1.960815
H  1.857819 3.12113 0.69187
H  1.791998 4.312263 -0.659657
H  -1.704902 3.857521 1.659368
H  -0.287885 2.835149 2.107472
H  0.277843 5.094307 1.052154
H  -3.068616 -0.254295 -1.899217
H  3.235609 -0.240155 -2.383164
H  -1.839886 -2.786627 2.228526
H  2.968981 -1.322739 2.474952
H  -4.117838 -3.087009 1.224327
H  5.342081 -0.513839 -1.068993
H  5.202304 -1.052894 1.40072
