program: Gaussian 09
title: 000215001
version: EM64L-G09RevD.01
frameworkgroup: C1[X(C10H5I4NO5)]
method: RPBEPBE
basis: SDD
operation: Freq
keyword: #p
keyword: freq=noraman
keyword: PBEPBE/SDD
title: #p freq=noraman PBEPBE/SDD
converged: YES YES NO NO
title: Mulliken charges:
elementType: I I I I O O O O O N C C C C C C C C C C H H H H H
charge: 0.196777 0.197025 0.209656 0.209538 -0.198822 -0.361395 -0.168185 -0.447499 -0.209337 -0.336610 0.506782 -0.459543 -0.459451 0.629553 -0.453960 -0.453614 0.059688 -0.377073 -0.020166 0.185500 0.379377 0.288234 0.289014 0.395442 0.399068
chargesum: 0.00000
title: Mulliken charges with hydrogens summed into heavy atoms:
elementType: I I I I O O O O O N C C C C C C C C C C
charge: 0.196777 0.197025 0.209656 0.209538 -0.198822 0.034047 -0.168185 -0.048430 -0.209337 0.042767 0.506782 -0.459543 -0.459451 0.629553 -0.453960 -0.453614 0.059688 0.200175 -0.020166 0.185500
polarizability: 2.89755329e+02 -6.63901464e-01 3.07671513e+02 2.18624452e+01 6.14875114e-01 1.26654097e+02
1716.lowfreq: -6.6490 -4.9256 -2.9875 -0.0002 0.0002 0.0003 13.1674 20.3345 21.9077
frequency: 13.1604 20.3040 21.9004 41.4464 43.1031 51.9282 64.8540 68.5713 95.5907 99.3150 100.3853 107.4050 121.4680 131.2873 148.5369 155.4909 184.4434 200.6097 208.8421 241.0152 264.4984 290.9694 321.4652 408.7551 440.4782 442.0071 487.1647 493.8714 523.5516 545.7820 551.3041 604.4891 623.8492 629.9628 649.4979 678.8866 688.6969 711.3558 738.9397 745.7510 764.4093 827.5942 893.2533 977.3910 994.5313 1048.9381 1077.6136 1096.1030 1160.9462 1212.2986 1228.4027 1258.9938 1275.4437 1302.8415 1303.5300 1327.4749 1357.9507 1452.5130 1467.9611 1479.1819 1511.6937 1602.7190 1648.9703 1687.1263 2991.2765 3030.0257 3504.1922 3537.7134 3541.9334
redmass: 12.0939 15.5048 55.8832 13.2979 8.8583 3.2605 11.2996 10.1558 7.7569 34.0820 114.1893 71.1359 10.5732 9.5602 108.2465 99.7261 9.6542 13.1371 4.0782 12.1190 9.0519 12.1566 10.6384 6.5141 11.2339 9.6889 7.9132 1.8779 7.3817 4.0960 11.5139 1.3572 1.1668 5.2564 1.4826 10.4170 6.0901 8.8601 11.3346 10.3983 8.1999 5.7491 7.5659 2.0387 8.6501 4.0324 2.0339 5.4597 4.1663 1.0860 2.1484 11.7748 2.4099 11.9541 2.4454 1.7399 5.5759 1.0830 11.9776 2.1138 10.5687 9.2707 10.2180 9.3869 1.0600 1.0995 1.0640 1.0648 1.0787
irintensity: 0.1579 0.4154 0.2872 0.1945 3.0549 3.8845 0.2317 1.9849 1.2910 0.5011 0.0132 0.4898 4.5238 0.0318 0.0020 0.0046 3.7706 2.8500 1.0808 0.8844 1.5614 0.0013 3.4961 2.7067 18.8830 31.3646 59.9070 26.8399 3.3453 37.3623 0.8923 82.7842 17.3083 17.5807 198.2697 5.8731 14.5392 1.2753 2.7840 3.0985 0.6673 12.8470 12.2263 0.3633 97.4684 349.2858 214.6362 61.2723 25.0765 1.5621 62.3403 230.3435 23.6701 0.9602 55.9482 1.4348 34.2580 8.2641 0.0563 430.6405 6.8993 168.0351 233.5701 299.5641 22.8189 1.8836 47.4248 25.1215 97.8131
temp: 298.150 k
press: 1.00000 atm
elementType: 53 53 53 53 8 8 8 8 8 7 6 6 6 6 6 6 6 6 6 6 1 1 1 1 1
symmnumber: 1
zpe: 356032.3 jmol-1
zpe.correction: 0.135606 hartree
zpe.thermalcorrener: 0.157890 hartree
zpe.thermalcorrenthalpy: 0.158834 hartree
zpe.thermalcorrgfe: 0.075616 hartree
zpe.sumelectzpe: -859.510005 hartree
zpe.sumelectthermal: -859.487721 hartree
zpe.sumelectthermalent: -859.486777 hartree
zpe.sumelectthermalfe: -859.569994 hartree
dipole: 0.6044 0.0457 2.8077
dipole: 2.8724
quadrupole: -167.4940 -157.7325 -178.7502
quadrupole: -0.2966 -17.5840 -0.3094
quadrupole: 0.4982 10.2598 -10.7580 -0.2966 -17.5840 -0.3094
hfenergy: -859.6456104 hartree
pointgroup: C01 [X(C10H5I4N1O5)]
dipole: 0.1682483 -0.0246578 1.1172346 debye
dipolederiv: -0.0567025 0.3122648 -0.0296146 0.2038779 -0.3435974 0.0507192 -0.0224915 0.0524117 0.0742791 -0.0555842 -0.3088303 -0.0489737 -0.2026354 -0.3364923 -0.0767277 -0.0353429 -0.0785 0.0663057 -0.091536 0.2901271 -0.0248499 0.2581518 -0.3554967 0.050399 -0.0424057 0.064375 0.0829853 -0.0916301 -0.2876226 -0.0434984 -0.2552619 -0.3461012 -0.0781326 -0.0597051 -0.0919239 0.0734379 -0.7482314 0.0068878 -0.181901 -0.0049789 -0.3150147 0.0181125 0.1918675 0.0180095 -0.9187071 -0.8466958 -0.0163591 0.4782667 -0.0180384 -0.3745151 0.0128661 0.5181892 0.0118688 -0.7244376 -0.739366 0.0083848 -0.2541661 -0.0001247 -0.3265022 0.0189791 -0.0135266 0.018475 -0.8809788 -0.6139794 0.0049328 -0.3163003 0.0049552 -0.3712914 0.0105524 -0.3562193 0.0120831 -0.986605 -1.207 0.0044738 -0.082276 0.0006612 -0.2996053 0.0044121 0.2188387 0.0034631 -0.5551237 -1.1089454 -0.0092339 0.3186626 -0.0137951 -0.372291 0.0119412 0.5144377 0.0095287 -0.7018292 -0.4609049 0.0046933 -0.1300246 0.0027121 -0.4946375 -0.0133122 -0.0843102 -0.0141309 -0.0494571 0.1032291 -0.5301478 0.0610261 -0.6799788 0.5898111 -0.1842838 0.0650132 -0.1085975 -0.1036541 0.1020337 0.5257094 0.094036 0.6749677 0.5692693 0.2258418 0.1078478 0.150221 -0.08264 -0.4429007 0.0028991 -0.0863953 0.0048122 -0.4442104 -0.0132476 -0.134517 -0.0138097 -0.022471 0.2250355 -0.5413429 0.0610416 -0.7498185 0.5603056 -0.18074 0.0683747 -0.1163328 -0.1038004 0.2246393 0.5343338 0.0955084 0.743655 0.5375404 0.2230792 0.1176481 0.158536 -0.0812646 1.499401 0.0023127 -0.1276435 0.0191797 0.2750188 -0.032723 -0.6220958 -0.0313483 1.3121726 0.5336816 0.0001645 0.0615528 -0.0060885 0.247663 0.0075652 0.3396957 0.0058754 -0.1467019 1.5499672 0.0038709 -0.0918304 0.0112833 0.415762 -0.0355325 -0.2878226 -0.0339532 1.4147599 1.6368484 -0.0081465 0.1850994 -0.0052814 0.1951656 -0.0177525 -0.0788722 -0.0183397 1.3741343 0.2353334 0.0005412 -0.0514599 0.003976 0.252537 -0.0005912 -0.192562 0.0009107 0.2518592 -0.012783 -0.0089636 0.0469126 -0.0680317 0.0151318 -0.0480156 -0.0565861 -0.0423928 0.0887841 -0.0074097 0.0059386 0.047505 0.0690397 0.0133086 0.0433368 -0.0550323 0.0398107 0.0928467 0.2386962 0.0036787 -0.1011507 0.005388 0.3284144 0.0033417 -0.1662861 0.0034642 0.2309343 0.1348036 -0.0005663 0.1204732 0.0013733 0.3798276 -0.0000875 0.0658628 0.0002958 0.2951715 unknown
polarizability: 286.3436889|-1.2596175|307.4997117|31.9072353|5.8663292|130.237538 unknown
InChI: InChI=1S/C10H5I4NO5/c11-5-3(9(18)15-1-2(16)17)6(12)8(14)4(7(5)13)10(19)20/h15-16,19H,1H2
charge 0 multiplicity 1
25 atoms
I  -0.568413 3.067525 -0.600246
I  -0.569733 -3.03992 -0.792474
I  2.986646 -3.064822 0.199492
I  2.987345 3.028119 0.394708
O  -1.922962 0.063465 -2.273953
O  4.867617 0.009919 -0.467023
O  4.403112 -0.070179 1.814569
O  -4.107993 -0.020799 2.062798
O  -6.107169 0.004789 0.869165
N  -2.550597 -0.005186 -0.037519
C  -0.167118 0.009794 -0.569043
C  0.519226 1.232759 -0.342954
C  0.518312 -1.225485 -0.420158
C  2.566115 -0.014823 0.184306
C  1.885185 -1.23972 -0.043667
C  1.885993 1.222427 0.033972
C  -1.617758 0.025413 -1.045986
C  -3.977964 0.009335 -0.354774
C  4.011903 -0.029389 0.631174
C  -4.862083 -0.001446 0.878911
H  -2.276659 -0.027437 0.947962
H  -4.249357 -0.861612 -0.983405
H  -4.23454 0.901616 -0.959165
H  5.814604 0.000585 -0.155997
H  -4.709713 -0.027327 2.854307
