program: Gaussian 09
title: 000214998
version: EM64L-G09RevD.01
frameworkgroup: C1[X(C11H9I4NO4)]
method: RPBEPBE
basis: SDD
operation: Freq
keyword: #p
keyword: freq=noraman
keyword: PBEPBE/SDD
title: #p freq=noraman PBEPBE/SDD
converged: YES YES NO NO
title: Mulliken charges:
elementType: I I I I O O O O N C C C C C C C C C C C H H H H H H H H H
charge: 0.184114 0.202051 0.212751 0.215238 -0.456889 -0.190826 -0.364969 -0.163303 -0.323799 -0.355109 -0.022860 0.506463 0.027320 -0.687525 -0.458888 -0.462861 0.627057 -0.453108 -0.455461 -0.019643 0.240692 0.224537 0.236987 0.337022 0.240864 0.221197 0.207782 0.335294 0.395873
chargesum: 0.00000
title: Mulliken charges with hydrogens summed into heavy atoms:
elementType: I I I I O O O O N C C C C C C C C C C C
charge: 0.184114 0.202051 0.212751 0.215238 -0.121595 -0.190826 0.030904 -0.163303 0.013223 0.110119 0.214127 0.506463 0.027320 -0.017683 -0.458888 -0.462861 0.627057 -0.453108 -0.455461 -0.019643
polarizability: 3.20137912e+02 -6.14192573e+00 3.15335848e+02 7.10536198e+00 2.50011564e+00 1.23113051e+02
1716.lowfreq: -4.8251 -0.0003 -0.0003 -0.0001 0.5008 1.5101 18.6487 21.1589 33.2856
frequency: 18.6413 21.1572 33.2709 40.8680 43.1862 62.8900 72.9765 76.5987 96.0326 100.6139 102.5371 108.0813 122.3997 133.2159 148.6031 154.4047 158.0232 198.4156 200.2138 235.3428 251.1044 275.0953 291.0994 319.0010 340.4201 372.2953 408.4639 427.6182 441.0494 462.4982 501.2045 532.8305 550.8181 572.4148 602.0274 635.7006 676.4992 689.5650 710.6063 736.7743 745.2557 758.3307 815.4208 841.1610 898.3900 932.9962 982.5777 1021.6290 1046.1085 1067.1630 1100.4963 1137.8076 1157.1778 1228.2766 1242.4861 1258.3786 1259.1898 1279.1873 1302.7998 1312.5102 1341.6852 1352.7408 1378.7908 1394.6541 1429.0369 1459.6946 1467.0952 1474.5682 1482.1294 1510.7454 1609.8439 1651.5593 2985.0269 2991.7781 3012.8014 3082.8176 3091.8229 3103.8460 3503.3293 3508.0475 3551.9241
redmass: 8.9629 34.4702 5.0193 8.1722 7.7579 3.8445 10.0400 5.8511 8.5101 30.9696 27.3093 74.7502 11.3838 9.5553 102.9734 19.6103 10.3898 1.0584 9.7353 8.7096 4.9603 3.3846 11.6027 5.1675 1.3438 2.6255 6.2805 6.3634 2.6417 4.8549 10.5752 3.6460 11.0737 1.3037 1.3181 5.0477 10.3985 6.8515 10.1925 11.2797 9.2699 4.9922 3.2935 4.1906 2.2378 1.8239 5.2523 4.2021 2.3456 3.5050 1.9999 2.2179 4.1446 2.2699 1.2090 11.3787 1.3757 2.4849 11.4065 1.2491 1.2271 6.4787 1.3482 1.3976 1.1363 1.0567 11.7703 1.4270 1.2589 10.9699 8.1876 10.2113 1.0852 1.0363 1.0588 1.1039 1.1011 1.0995 1.0640 1.0658 1.0787
irintensity: 0.2585 0.0690 0.8788 0.2017 1.1243 0.6194 2.2106 4.2759 1.9526 1.0711 0.9032 0.4067 5.2236 0.1241 0.0285 1.1788 3.2924 1.1245 1.2652 0.3971 6.0200 1.1057 0.7914 19.3822 101.8581 23.9501 4.0958 8.3012 13.2586 17.1012 25.9796 28.6203 1.1516 11.1190 128.6165 12.4606 4.2042 14.0564 0.0838 1.2847 5.3591 1.8812 13.6102 2.8476 12.1641 0.3265 36.6414 139.9430 78.5839 257.7232 7.5757 25.4873 29.1873 117.8650 70.8092 222.8180 33.7207 8.3269 0.8973 9.9477 11.1899 38.1125 2.6020 33.8149 24.8180 11.7753 0.5304 149.9536 70.2919 7.9864 161.5269 227.6196 16.5050 19.5103 32.9975 0.4806 40.4019 22.1568 49.3876 46.0052 32.2967
temp: 298.150 k
press: 1.00000 atm
elementType: 53 53 53 53 8 8 8 8 7 6 6 6 6 6 6 6 6 6 6 6 1 1 1 1 1 1 1 1 1
symmnumber: 1
zpe: 476687.0 jmol-1
zpe.correction: 0.181560 hartree
zpe.thermalcorrener: 0.204887 hartree
zpe.thermalcorrenthalpy: 0.205831 hartree
zpe.thermalcorrgfe: 0.121896 hartree
zpe.sumelectzpe: -824.751160 hartree
zpe.sumelectthermal: -824.727834 hartree
zpe.sumelectthermalent: -824.726890 hartree
zpe.sumelectthermalfe: -824.810825 hartree
dipole: 0.7946 -0.5333 3.6385
dipole: 3.7623
quadrupole: -170.1714 -156.8713 -184.2048
quadrupole: 3.6562 8.5811 -0.9868
quadrupole: 0.2445 13.5445 -13.7890 3.6562 8.5811 -0.9868
hfenergy: -824.9327209 hartree
pointgroup: C01 [X(C11H9I4N1O4)]
dipole: -0.1643062 0.3002729 1.440079 debye
polarizability: 314.5337829|-6.0005446|320.1914211|-14.0666126|1.9008675|123.8616078 unknown
InChI: InChI=1S/C11H9I4NO4/c1-3(17)2-16-10(18)4-6(12)8(14)5(11(19)20)9(15)7(4)13/h3,16-17,19H,2H2,1H3
charge 0 multiplicity 1
29 atoms
I  1.054162 -2.667693 -0.453871
I  0.096879 3.370889 -0.256702
I  -3.513793 2.768597 0.247334
I  -2.551054 -3.24519 0.059074
O  4.402067 -1.47217 1.158141
O  2.093814 0.660968 -1.744287
O  -4.439357 -0.518795 1.583712
O  -4.911523 -0.506711 -0.697721
N  2.437181 0.609871 0.562609
C  3.889458 0.860321 0.486882
C  4.691582 -0.424815 0.158829
C  0.168479 0.28928 -0.284905
C  1.65107 0.537792 -0.565792
C  6.198801 -0.171942 0.216101
C  -0.334683 -1.036946 -0.227376
C  -0.722122 1.388395 -0.151928
C  -2.606242 -0.167626 0.08718
C  -2.108986 1.161484 0.036014
C  -1.72015 -1.270029 -0.039308
C  -4.093194 -0.41068 0.237335
H  4.074369 1.620814 -0.293669
H  4.217042 1.255134 1.464877
H  4.396112 -0.771759 -0.852673
H  1.997195 0.515052 1.479741
H  6.746549 -1.095015 -0.036178
H  6.497487 0.135022 1.234683
H  6.494482 0.618862 -0.496736
H  3.476134 -1.798753 1.006909
H  -5.419858 -0.67876 1.665126
