program: Gaussian 09
title: 000214988
version: EM64L-G09RevD.01
frameworkgroup: C1[X(C12H13FN2O3)]
method: RPBEPBE
basis: SDD
operation: Freq
keyword: #p
keyword: freq=noraman
keyword: PBEPBE/SDD
title: #p freq=noraman PBEPBE/SDD
converged: YES YES NO NO
title: Mulliken charges:
elementType: F O O O N N C C C C C C C C C C C C H H H H H H H H H H H H H
charge: -0.198048 -0.242381 -0.258887 -0.291418 -0.287192 -0.397282 -0.248123 -0.391427 0.551413 0.281261 0.318173 -0.424699 -0.333790 -0.356543 -0.363672 -0.338116 0.321462 -0.646133 0.256251 0.267889 0.275943 0.240205 0.249133 0.358793 0.262033 0.261241 0.251409 0.218323 0.213040 0.234039 0.217101
chargesum: 0.00000
title: Mulliken charges with hydrogens summed into heavy atoms:
elementType: F O O O N N C C C C C C C C C C C C
charge: -0.198048 -0.242381 -0.258887 -0.291418 -0.287192 -0.038489 0.008128 0.152406 0.551413 0.281261 0.318173 -0.184493 -0.084657 -0.094510 -0.102431 0.131616 0.321462 0.018047
polarizability: 2.22398354e+02 -7.12725560e+00 1.10894826e+02 9.61860590e+00 3.52043155e+00 1.24859118e+02
1716.lowfreq: -30.5739 -6.9770 -4.5546 -0.0006 -0.0004 -0.0003 6.5454 21.2554 24.5263
frequency: -29.3198 20.9734 24.4107 53.1205 74.6625 97.3633 130.9966 150.7665 187.6440 202.5443 224.4275 239.4197 245.4795 313.7170 341.1646 380.2715 386.8774 406.7582 417.2949 459.1854 518.9380 534.9283 595.3415 617.2031 651.4750 680.1887 683.5658 709.2103 729.0716 748.1113 754.6738 763.0469 812.4651 819.2322 832.9490 835.8762 892.0439 898.0886 944.1863 959.2953 976.9965 1005.7764 1007.6160 1055.8927 1062.2370 1091.5847 1111.3934 1153.4683 1157.2702 1166.4602 1190.6389 1201.4764 1204.4635 1224.2252 1255.1137 1286.4406 1293.5546 1298.6007 1327.2877 1355.9741 1357.5634 1386.1622 1398.0337 1418.7265 1464.3317 1469.6740 1481.2264 1493.2965 1500.8954 1535.9032 1604.5730 1616.5003 1634.4306 1688.9601 2985.3292 3006.3346 3018.6577 3031.5835 3072.1704 3087.0796 3100.3574 3104.3272 3136.3452 3146.1058 3178.2135 3180.6470 3397.1972
redmass: 2.5344 4.2374 4.7336 7.9347 4.8299 6.9664 4.6039 3.5051 3.4089 6.4660 1.9884 5.4469 2.7847 3.1949 6.7814 6.1809 5.4413 4.0483 3.8927 3.5791 3.4186 4.5961 5.0820 5.8778 4.2746 7.3803 5.8512 5.7560 3.7149 1.6563 1.5969 3.7691 3.2285 1.3554 2.0751 1.8559 2.2010 4.4763 1.3963 1.3701 3.0860 2.9784 2.7255 2.7315 4.3646 2.0362 1.3330 1.8359 1.4800 1.6183 3.4146 1.8127 1.8035 2.4892 4.3524 1.2869 1.1303 1.3046 2.0312 1.5920 1.5733 1.2135 5.1636 2.2850 1.0712 1.0481 1.0618 1.1313 2.5265 1.7261 7.4152 6.4089 10.3471 7.7248 1.0353 1.0644 1.0673 1.0843 1.0996 1.0983 1.1026 1.1011 1.0905 1.0899 1.0956 1.0963 1.0807
irintensity: 0.1283 0.2204 0.1664 0.1136 2.4374 10.5253 4.5066 5.1013 0.1521 1.4253 4.0178 4.1406 4.4103 22.7023 9.0006 1.8131 1.7515 2.3358 0.2608 2.5806 24.7106 29.8869 5.8975 1.0018 0.2436 1.8026 19.0756 3.1328 0.9524 85.7782 58.5087 20.6260 8.0110 1.6844 32.0124 61.4093 18.2325 117.2225 0.3581 0.3615 68.5332 45.0344 22.9176 15.3259 68.1287 49.8994 12.9951 9.4672 117.7218 105.3654 137.1139 13.3703 67.5018 43.6426 247.0127 6.7217 30.3328 43.6736 145.3617 12.5967 22.5639 18.0973 2.1701 4.7571 25.3377 16.5267 11.7753 73.7931 59.4688 473.8290 7.0424 39.3438 21.6423 573.0673 26.6974 45.0817 17.2624 21.8325 4.7335 45.5361 32.6892 7.0392 8.5248 7.5879 2.2740 1.5674 126.8716
temp: 298.150 k
press: 1.00000 atm
elementType: 9 8 8 8 7 7 6 6 6 6 6 6 6 6 6 6 6 6 1 1 1 1 1 1 1 1 1 1 1 1 1
symmnumber: 1
zpe: 623601.7 jmol-1
zpe.correction: 0.237517 hartree
zpe.thermalcorrener: 0.253296 hartree
zpe.thermalcorrenthalpy: 0.254240 hartree
zpe.thermalcorrgfe: 0.192121 hartree
zpe.sumelectzpe: -898.807847 hartree
zpe.sumelectthermal: -898.792069 hartree
zpe.sumelectthermalent: -898.791125 hartree
zpe.sumelectthermalfe: -898.853244 hartree
dipole: -0.1362 -0.4665 1.3063
dipole: 1.3938
quadrupole: -102.1635 -116.5588 -101.1670
quadrupole: 0.7834 9.6501 11.7606
quadrupole: 4.4662 -9.9290 5.4628 0.7834 9.6501 11.7606
hfenergy: -899.0453648 hartree
pointgroup: C01 [X(C12H13F1N2O3)]
dipole: -0.0602603 -0.3826629 0.3881293 debye
polarizability: 222.1920585|-10.0614696|110.6044957|7.7395303|-3.2336082|125.3557437 unknown
InChI: InChI=1S/C12H13FN2O3/c1-2-14-11(16)15-7-10(18-12(15)17)8-3-5-9(13)6-4-8/h3-6,10,14H,2,7H2,1H3
charge 0 multiplicity 1
31 atoms
F  5.919116 -0.601757 -0.931263
O  0.019436 1.489675 0.451936
O  -2.145353 2.161617 -0.127266
O  -2.957002 -2.00995 0.53311
N  -1.625356 -0.094015 0.447086
N  -3.952538 0.059291 0.016706
C  0.628684 0.238066 1.058153
C  -0.400377 -0.876582 0.709688
C  2.025351 0.032218 0.524884
C  -1.348971 1.262155 0.224307
C  -2.899914 -0.761031 0.332431
C  3.113902 -0.085419 1.422289
C  2.263024 -0.053774 -0.871376
C  4.425361 -0.305262 0.946538
C  3.565112 -0.261329 -1.368191
C  -5.315331 -0.474693 -0.15147
C  4.617008 -0.388707 -0.442177
C  -5.717863 -0.624108 -1.634383
H  0.653145 0.41646 2.148356
H  -0.105995 -1.452901 -0.18561
H  -0.555371 -1.583333 1.538453
H  2.942282 -0.004479 2.501926
H  1.432788 0.069378 -1.575204
H  -3.75427 1.054571 -0.162321
H  5.277199 -0.402097 1.625107
H  3.771111 -0.320255 -2.440558
H  -5.346537 -1.455765 0.351473
H  -6.019671 0.19986 0.370639
H  -5.673545 0.34551 -2.162857
H  -5.044995 -1.332073 -2.148548
H  -6.751032 -1.009671 -1.71136
