program: Gaussian 09
title: 000214984
version: EM64L-G09RevD.01
frameworkgroup: C1[X(C12H13ClN2O3)]
method: RPBEPBE
basis: SDD
operation: Freq
keyword: #p
keyword: freq=noraman
keyword: PBEPBE/SDD
title: #p freq=noraman PBEPBE/SDD
converged: YES YES NO NO
title: Mulliken charges:
elementType: Cl O O O N N C C C C C C C C C C C C H H H H H H H H H H H H H
charge: -0.042278 -0.243063 -0.258141 -0.291311 -0.287169 -0.397067 -0.245725 -0.389563 0.553019 0.280722 0.318002 -0.445224 -0.355062 -0.196155 -0.208320 -0.337856 -0.112138 -0.646325 0.256298 0.267915 0.275755 0.240099 0.249698 0.358608 0.260922 0.259858 0.251999 0.218731 0.213122 0.233302 0.217346
chargesum: 0.00000
title: Mulliken charges with hydrogens summed into heavy atoms:
elementType: Cl O O O N N C C C C C C C C C C C C
charge: -0.042278 -0.243063 -0.258141 -0.291311 -0.287169 -0.038459 0.010573 0.154107 0.553019 0.280722 0.318002 -0.205125 -0.105363 0.064766 0.051537 0.132874 -0.112138 0.017445
polarizability: 2.49229030e+02 -8.06979483e+00 1.16878988e+02 9.19519277e+00 8.25585181e+00 1.26386244e+02
1716.lowfreq: -20.4557 -10.6793 -3.0335 -0.0017 -0.0017 0.0010 2.3147 16.8711 24.5965
frequency: -19.6430 16.0162 24.5544 47.1275 74.4491 96.5676 117.8922 148.6432 177.2000 185.8216 214.0015 227.3877 242.0524 301.0263 313.2812 330.1555 372.4723 393.8429 407.5125 434.6153 473.7425 513.4962 589.1134 615.7789 640.3922 673.2645 680.4843 694.7407 708.9570 722.4393 747.6337 757.2479 798.8698 828.5510 830.0359 833.6503 892.0766 898.5907 950.2782 965.9578 977.2805 1001.7187 1006.5740 1055.8795 1062.5458 1074.2959 1091.8339 1114.8878 1153.4967 1164.1800 1186.5052 1190.2015 1202.3920 1221.2042 1253.8923 1287.9447 1292.9828 1298.3984 1324.4109 1353.6724 1357.0747 1387.7508 1388.7567 1409.5128 1465.6764 1470.9435 1481.4020 1482.0242 1493.8124 1534.2325 1590.1137 1605.5286 1634.7082 1689.1219 2985.2911 3004.5018 3017.1390 3028.8312 3071.7821 3087.1940 3100.1854 3104.7901 3133.0339 3143.4626 3172.8264 3175.6729 3396.5298
redmass: 2.5430 4.2414 5.0502 8.6316 4.9935 6.8560 5.1638 3.7699 3.0849 9.6086 6.5477 2.0329 2.4443 4.7198 3.3914 5.5589 5.8837 6.6508 2.9651 4.6744 4.3968 3.3906 4.3382 5.7901 4.7079 7.4284 6.7450 5.2747 5.5400 3.5812 1.4668 1.6381 4.2084 1.4474 1.3723 2.1277 2.1923 4.3537 1.3964 1.3828 3.0838 4.0693 2.9981 2.8388 4.3288 2.7364 2.0372 1.3679 1.8303 1.6385 1.1524 3.0865 1.8032 2.0103 4.3684 1.2711 1.1292 1.3100 2.0379 1.9500 1.3386 1.2150 5.4318 2.0974 1.0697 1.0479 1.0655 2.4967 1.0959 1.7279 7.1971 6.2165 10.3904 7.7903 1.0354 1.0648 1.0683 1.0836 1.0993 1.0982 1.1024 1.1009 1.0903 1.0897 1.0953 1.0965 1.0807
irintensity: 0.0952 0.2746 0.1206 0.0604 2.5898 10.3231 2.6164 4.8578 2.1738 1.1774 0.4166 5.7509 6.6331 0.0415 20.4551 10.8871 6.6197 1.6603 0.1811 4.5288 24.4209 25.9654 3.1933 0.6442 0.6167 3.9826 5.2323 21.5201 2.7034 2.1234 124.8952 29.7510 7.4854 42.5100 19.0197 17.7356 16.4855 144.6116 0.1655 0.4897 74.5105 52.3060 44.5843 23.7802 62.2062 45.7665 45.6857 10.8639 7.2587 183.3614 9.6393 131.2944 59.0432 10.0917 249.8112 4.1429 33.3287 46.9364 132.5938 36.1835 11.8433 18.5289 3.4998 8.1755 25.0179 17.2977 10.4035 68.0572 43.0682 486.0478 2.2990 30.0923 22.5405 582.0137 26.6832 46.5046 16.5509 22.7839 5.1254 45.1976 32.6408 6.7760 8.4652 6.6565 4.3121 0.1286 126.2011
temp: 298.150 k
press: 1.00000 atm
elementType: 17 8 8 8 7 7 6 6 6 6 6 6 6 6 6 6 6 6 1 1 1 1 1 1 1 1 1 1 1 1 1
symmnumber: 1
zpe: 620061.1 jmol-1
zpe.correction: 0.236169 hartree
zpe.thermalcorrener: 0.252343 hartree
zpe.thermalcorrenthalpy: 0.253287 hartree
zpe.thermalcorrgfe: 0.189712 hartree
zpe.sumelectzpe: -1259.026986 hartree
zpe.sumelectthermal: -1259.010812 hartree
zpe.sumelectthermalent: -1259.009868 hartree
zpe.sumelectthermalfe: -1259.073443 hartree
dipole: -0.1700 -0.1095 1.3638
dipole: 1.3787
quadrupole: -108.9706 -117.0227 -115.7161
quadrupole: 2.9498 7.8586 14.6705
quadrupole: 4.9326 -3.1196 -1.8130 2.9498 7.8586 14.6705
hfenergy: -1259.2631551 hartree
pointgroup: C01 [X(C12H13Cl1N2O3)]
dipole: -0.0676352 -0.3646739 0.3958136 debye
polarizability: 248.9303068|-13.8021772|112.8198465|1.0355211|-2.5663363|130.7441086 unknown
InChI: InChI=1S/C12H13ClN2O3/c1-2-14-11(16)15-7-10(18-12(15)17)8-3-5-9(13)6-4-8/h3-6,10,14H,2,7H2,1H3
charge 0 multiplicity 1
31 atoms
Cl 6.305023 -0.691028 -0.99762
O  -0.012281 1.510468 0.383391
O  -2.176923 2.143441 -0.238932
O  -2.968442 -1.999905 0.603718
N  -1.648199 -0.081358 0.438974
N  -3.973265 0.037519 -0.012878
C  0.598216 0.293087 1.050945
C  -0.419976 -0.8437 0.743274
C  2.000474 0.071032 0.538569
C  -1.378392 1.264999 0.157517
C  -2.918064 -0.761126 0.346849
C  3.076821 -0.042389 1.449932
C  2.257154 -0.039021 -0.851731
C  4.392155 -0.28151 0.992797
C  3.564992 -0.265992 -1.326704
C  -5.332267 -0.510369 -0.166305
C  4.613909 -0.390606 -0.392567
C  -5.739984 -0.683545 -1.645105
H  0.61213 0.51927 2.132489
H  -0.114477 -1.454555 -0.125064
H  -0.576261 -1.515709 1.600136
H  2.89636 0.056833 2.526876
H  1.439526 0.08073 -1.571016
H  -3.779755 1.025236 -0.234104
H  5.223693 -0.373021 1.696824
H  3.767942 -0.340878 -2.398685
H  -5.351387 -1.484169 0.350988
H  -6.041044 0.164611 0.34954
H  -5.705207 0.278879 -2.187304
H  -5.064438 -1.393599 -2.152868
H  -6.770735 -1.077321 -1.711839
