program: Gaussian 09
title: 000214999
version: EM64L-G09RevD.01
frameworkgroup: C1[X(C11H9I4NO5)]
method: RPBEPBE
basis: SDD
operation: Freq
keyword: #p
keyword: freq=noraman
keyword: PBEPBE/SDD
title: #p freq=noraman PBEPBE/SDD
converged: YES YES NO NO
title: Mulliken charges:
elementType: I I I I O O O O O N C C C C C C C C C C C H H H H H H H H H
charge: 0.207637 0.199361 0.220002 0.218529 -0.441476 -0.477284 -0.242108 -0.360311 -0.166151 -0.291392 -0.039363 -0.433269 0.519779 -0.383388 0.054870 -0.461772 -0.474763 0.628589 -0.454416 -0.452663 -0.019237 0.214936 0.255160 0.251206 0.334096 0.205964 0.246933 0.359324 0.384169 0.397035
chargesum: 0.00000
title: Mulliken charges with hydrogens summed into heavy atoms:
elementType: I I I I O O O O O N C C C C C C C C C C C
charge: 0.207637 0.199361 0.220002 0.218529 -0.082151 -0.093115 -0.242108 0.036724 -0.166151 0.042705 0.175573 0.073097 0.519779 0.069509 0.054870 -0.461772 -0.474763 0.628589 -0.454416 -0.452663 -0.019237
polarizability: 3.20564212e+02 -4.94801421e+00 3.20328795e+02 3.58043240e+00 1.20714498e+00 1.26006695e+02
1716.lowfreq: -18.4678 -7.1234 -4.3594 -0.0003 -0.0003 0.0001 5.5349 20.1333 24.9609
frequency: -14.9017 20.0873 24.6563 39.0087 41.1514 68.5067 75.1348 93.6352 101.1648 103.1671 108.3517 117.2516 132.3445 140.9326 148.9522 154.9519 156.7268 162.0304 201.8329 218.5891 247.6147 281.6833 290.7214 299.4113 332.4531 386.9228 408.9579 429.0308 461.5053 489.3931 523.7966 533.1241 551.9961 593.0588 603.5977 608.3025 638.8468 679.2341 687.9476 710.5374 713.0176 739.4962 745.9497 759.9536 807.2937 852.3279 892.1635 941.0930 982.7883 1003.7675 1019.7421 1058.1608 1060.6259 1099.2275 1152.9169 1182.1977 1223.0952 1233.0319 1253.5636 1258.8191 1284.8491 1301.2932 1323.0905 1346.4379 1356.0880 1358.7511 1379.9954 1396.4006 1448.1387 1455.6659 1467.2705 1484.7529 1512.3217 1590.8706 1648.1026 2994.9683 3017.1657 3041.1377 3078.3109 3092.5151 3364.0481 3479.3631 3502.9575 3542.3717
redmass: 6.0792 23.6016 15.1665 8.0637 12.9981 10.0759 7.7900 13.9878 58.5715 8.5335 64.7475 6.4264 9.4967 7.9334 98.3614 10.0656 8.2140 8.9264 8.2133 9.2767 8.9988 3.9144 11.3862 3.5615 6.6902 3.2333 6.3243 7.0869 6.8486 8.1085 1.2127 3.1025 11.2036 1.3381 1.3068 2.3017 4.8215 10.1261 6.6841 3.4248 1.4790 11.2886 10.2070 4.2867 4.0138 5.3745 2.4671 3.5371 6.5806 2.4040 5.2120 2.1091 3.6553 2.5036 3.9979 1.1840 1.4645 1.9664 1.3583 11.7090 2.6407 11.2366 1.2808 1.2913 1.9614 2.3318 1.3120 1.1666 1.1365 1.0793 11.7660 1.9490 10.0581 6.5622 10.2527 1.0618 1.0608 1.0858 1.1024 1.1037 1.0664 1.0650 1.0640 1.0785
irintensity: 0.4712 0.2869 0.2000 0.7380 0.2349 1.8070 0.6610 0.9540 0.3872 8.0945 0.2419 2.5613 0.3037 3.6503 0.0505 1.9952 3.9657 3.5084 3.6441 2.4997 3.6319 3.7280 0.0495 2.0208 9.7269 8.1712 2.1781 28.8017 13.5447 48.7747 70.1631 14.4050 0.2649 9.5175 159.0526 27.4290 6.9446 6.7577 9.9132 39.4789 121.0577 2.7405 2.7720 1.8541 14.9687 8.3061 18.6003 73.7626 17.6329 78.7659 67.5794 175.3669 241.4332 16.1025 57.7613 52.2016 61.5484 54.8762 74.4583 219.9575 2.7993 0.6873 10.3617 5.4062 15.0575 29.9749 25.9411 112.5732 40.8417 10.4717 0.2956 223.1215 5.0209 139.2062 227.3556 19.8316 11.4377 36.5451 38.0609 11.8390 248.1395 23.8888 51.0405 34.3979
temp: 298.150 k
press: 1.00000 atm
elementType: 53 53 53 53 8 8 8 8 8 7 6 6 6 6 6 6 6 6 6 6 6 1 1 1 1 1 1 1 1 1
symmnumber: 1
zpe: 492339.3 jmol-1
zpe.correction: 0.187522 hartree
zpe.thermalcorrener: 0.210173 hartree
zpe.thermalcorrenthalpy: 0.211117 hartree
zpe.thermalcorrgfe: 0.129933 hartree
zpe.sumelectzpe: -899.887744 hartree
zpe.sumelectthermal: -899.865094 hartree
zpe.sumelectthermalent: -899.864149 hartree
zpe.sumelectthermalfe: -899.945333 hartree
dipole: 3.6222 0.4385 1.9528
dipole: 4.1384
quadrupole: -196.2502 -163.0391 -189.8013
quadrupole: -4.4775 -15.2934 -1.8221
quadrupole: -13.2200 19.9911 -6.7711 -4.4775 -15.2934 -1.8221
hfenergy: -900.0752665 hartree
pointgroup: C01 [X(C11H9I4N1O5)]
dipole: -1.4913511 0.138656 -0.6383918 debye
polarizability: 319.2085766|5.9584085|319.4941771|-11.6642353|17.0138334|128.196948 unknown
InChI: InChI=1S/C11H9I4NO5/c12-6-4(10(19)16-1-3(18)2-17)7(13)9(15)5(8(6)14)11(20)21/h3,16-18,20H,1-2H2
charge 0 multiplicity 1
30 atoms
I  0.033676 -3.297274 -0.071296
I  1.007505 2.727686 0.378417
I  -2.627527 3.292595 0.536227
I  -3.605942 -2.700167 0.068199
O  5.953923 -0.708072 -1.517337
O  5.011671 -0.117839 1.134344
O  2.258117 -0.657592 1.223973
O  -4.67196 0.45167 1.589325
O  -4.885591 0.669798 -0.720739
N  2.186045 -0.591032 -1.106265
C  4.683226 -0.002704 -1.300163
C  3.565159 -1.08432 -1.30344
C  0.114088 -0.218071 0.145659
C  4.759816 0.797251 0.01559
C  1.615414 -0.490136 0.138184
C  -0.786929 -1.317728 0.087877
C  -0.391107 1.103158 0.276577
C  -2.68458 0.227967 0.274141
C  -1.790126 1.328195 0.339368
C  -2.185985 -1.095715 0.151639
C  -4.178905 0.473092 0.287667
H  4.569544 0.681105 -2.160922
H  3.7853 -1.809435 -0.498423
H  3.609579 -1.621009 -2.26603
H  1.596762 -0.425693 -1.925139
H  3.842905 1.396979 0.17571
H  5.631269 1.472152 -0.032367
H  6.231251 -1.048009 -0.62217
H  4.120222 -0.464516 1.43366
H  -5.654822 0.617467 1.580036
