program: Gaussian 09
title: 000214982
version: EM64L-G09RevD.01
frameworkgroup: C1[X(C14H18N2O3)]
method: RPBEPBE
basis: SDD
operation: Freq
keyword: #p
keyword: freq=noraman
keyword: PBEPBE/SDD
title: #p freq=noraman PBEPBE/SDD
converged: YES YES NO NO
title: Mulliken charges:
elementType: O O O N N C C C C C C C C C C C C C C H H H H H H H H H H H H H H H H H H
charge: -0.241007 -0.263475 -0.290745 -0.289434 -0.397863 -0.241599 -0.393581 0.534913 0.280083 0.309471 -0.387580 -0.329354 -0.352337 -0.366900 -0.449089 -0.226197 -0.216667 -0.687147 -0.234059 0.252600 0.274397 0.269224 0.211771 0.252956 0.211556 0.193947 0.362147 0.192357 0.209216 0.241259 0.233512 0.231826 0.232867 0.211883 0.218846 0.207539 0.234664
chargesum: 0.00000
title: Mulliken charges with hydrogens summed into heavy atoms:
elementType: O O O N N C C C C C C C C C C C C C C
charge: -0.241007 -0.263475 -0.290745 -0.289434 -0.035715 0.011001 0.150041 0.534913 0.280083 0.309471 0.077147 0.076149 0.049235 -0.125641 -0.215577 0.005629 0.016200 -0.048880 0.000605
polarizability: 2.44125641e+02 -8.39561495e-01 1.47948239e+02 1.02968209e+01 -4.46577887e+00 1.28405716e+02
1716.lowfreq: -23.5309 -9.6201 -3.8534 0.0005 0.0008 0.0010 5.2083 16.9223 28.3654
frequency: -17.3544 16.0890 28.2952 43.5512 61.4343 76.9939 88.7061 116.4138 146.4444 163.5592 206.6474 220.4206 233.2388 235.5142 256.7473 280.3028 292.1924 347.7402 385.0010 401.1069 436.9725 507.3989 513.6641 578.9745 612.8526 614.4403 654.2354 681.5457 687.1774 702.7781 710.1702 732.2987 754.5374 767.6351 775.2977 797.8828 846.2264 847.5785 850.9677 895.0759 924.1928 935.8169 974.4481 976.4865 981.6969 992.4818 1000.1543 1013.5029 1026.8587 1044.8524 1055.0689 1080.2251 1094.0756 1119.5431 1138.8915 1167.3498 1175.4953 1187.0841 1190.2966 1202.7797 1222.1649 1229.9916 1255.0096 1265.4115 1290.9459 1292.4797 1309.1789 1313.2706 1339.4052 1349.9643 1364.0649 1365.7547 1388.7552 1393.3710 1447.1118 1458.2171 1460.6610 1474.5217 1477.5605 1486.5822 1486.8897 1492.9275 1537.9773 1597.3558 1616.9477 1632.0888 1685.9443 2964.5822 2973.2967 2976.4977 2989.8175 3010.2970 3020.4923 3030.1179 3042.6802 3069.7604 3075.1912 3079.1620 3105.7416 3122.0349 3128.1808 3139.6171 3152.4913 3168.3376 3397.8992
redmass: 4.1767 4.0870 4.2088 4.3741 4.8523 1.7684 6.1807 3.8218 4.4438 4.1826 6.6205 2.3712 1.9336 2.0534 3.7073 3.3511 4.3172 3.6133 7.0034 2.7854 4.2718 3.8484 2.7351 3.7344 5.9765 6.1878 4.8660 7.3661 5.7783 1.7001 6.2458 1.2572 1.4007 1.8780 2.1196 4.2188 1.8447 2.1860 1.2584 4.1249 1.5012 1.7372 1.6437 1.3985 2.6613 4.8027 1.3611 3.2149 2.1320 3.5463 2.7147 2.9588 1.6637 2.0045 2.1256 1.7008 1.0568 3.1479 1.1505 1.7163 1.9633 1.3366 4.2059 1.2923 1.1102 1.2562 1.6528 1.2184 1.5782 1.4347 1.4128 1.8044 1.2111 4.2735 2.1061 1.0784 1.0945 1.0593 1.0428 1.0976 2.1237 1.1344 1.7160 6.0176 6.1014 10.5208 7.4440 1.0594 1.0382 1.0584 1.0670 1.0977 1.0688 1.0823 1.1014 1.1007 1.0993 1.0987 1.1014 1.0879 1.0867 1.0913 1.0961 1.1016 1.0806
irintensity: 0.2016 0.1275 0.2944 0.1352 0.8326 0.0384 8.5444 2.5143 4.4329 4.9809 0.9183 5.4000 0.6220 0.1688 5.1614 1.0278 15.7659 17.5149 0.5868 0.5201 8.0209 8.5336 5.4553 7.0552 0.5309 11.7887 6.1874 5.3865 16.7578 50.9935 4.6963 21.7770 131.6871 45.6659 22.4950 9.1838 3.5163 9.8963 1.0796 95.9036 0.8675 48.2311 16.2001 0.1025 34.5715 1.0509 0.6139 72.8790 4.6696 38.0367 7.2469 54.4272 7.8254 6.2170 5.9619 194.2017 1.7820 127.5199 3.2291 49.3394 12.7503 3.5742 252.0397 13.4116 0.6864 5.8381 112.7575 12.0196 95.8882 3.3176 2.9096 12.2851 10.0701 1.4248 12.8046 6.9755 22.8244 9.1078 10.9149 18.7222 12.3030 40.6686 534.2097 0.5120 0.1559 22.5497 578.7075 17.6913 23.6606 66.0178 38.6589 1.5446 16.3126 23.6236 49.2531 90.7625 41.9998 12.8324 7.1604 7.0315 2.7480 11.5735 32.3802 19.4342 120.0203
temp: 298.150 k
press: 1.00000 atm
elementType: 8 8 8 7 7 6 6 6 6 6 6 6 6 6 6 6 6 6 6 1 1 1 1 1 1 1 1 1 1 1 1 1 1 1 1 1 1
symmnumber: 1
zpe: 792706.4 jmol-1
zpe.correction: 0.301926 hartree
zpe.thermalcorrener: 0.319455 hartree
zpe.thermalcorrenthalpy: 0.320399 hartree
zpe.thermalcorrgfe: 0.253949 hartree
zpe.sumelectzpe: -878.083585 hartree
zpe.sumelectthermal: -878.066055 hartree
zpe.sumelectthermalent: -878.065111 hartree
zpe.sumelectthermalfe: -878.131562 hartree
dipole: -2.0459 -0.1929 -1.1638
dipole: 2.3617
quadrupole: -86.0867 -110.6701 -126.5882
quadrupole: 2.8018 4.9826 -11.8482
quadrupole: 21.6949 -2.8885 -18.8065 2.8018 4.9826 -11.8482
hfenergy: -878.3855107 hartree
pointgroup: C01 [X(C14H18N2O3)]
dipole: -0.8032753 -0.0874932 -0.4587036 debye
polarizability: 244.1216509|2.9130498|148.4382397|10.0088787|-2.942244|127.9197061 unknown
InChI: InChI=1S/C14H18N2O3/c1-2-3-9-15-13(17)16-10-12(19-14(16)18)11-7-5-4-6-8-11/h4-8,12,15H,2-3,9-10H2,1H3
charge 0 multiplicity 1
37 atoms
O  -1.047699 -0.025941 1.484774
O  1.196952 0.352876 2.022864
O  1.803452 -1.657491 -1.728493
N  0.541314 -0.785868 0.032289
N  2.908787 -0.733102 0.133412
C  -1.777813 -0.873455 0.455234
C  -0.725973 -1.059967 -0.676007
C  -3.06838 -0.203736 0.049322
C  0.332693 -0.115002 1.245957
C  1.80383 -1.091964 -0.595429
C  4.272174 -0.952919 -0.379696
C  4.950261 0.344347 -0.881202
C  5.160191 1.407373 0.221246
C  -3.068071 1.09989 -0.509641
C  -4.297452 -0.885153 0.217865
C  -4.280415 1.707119 -0.897635
C  -5.51195 -0.282245 -0.180277
C  5.875118 2.671317 -0.303204
C  -5.505439 1.015393 -0.739192
H  -1.982193 -1.835933 0.958267
H  -0.731405 -2.077535 -1.094035
H  -0.87233 -0.344362 -1.504284
H  4.880249 -1.404047 0.428971
H  4.196272 -1.68465 -1.201927
H  4.345378 0.77045 -1.705671
H  5.933154 0.06891 -1.315694
H  2.757407 -0.248169 1.029628
H  5.751731 0.963692 1.04874
H  4.180662 1.695321 0.653118
H  -2.124781 1.648247 -0.616637
H  -4.306279 -1.888049 0.662559
H  -4.27396 2.717996 -1.31959
H  -6.457533 -0.819161 -0.048935
H  5.290113 3.15049 -1.110684
H  6.016846 3.417446 0.499784
H  6.871849 2.422251 -0.714254
H  -6.445958 1.487631 -1.043542
