program: Gaussian 09
title: 000214938
version: EM64L-G09RevD.01
frameworkgroup: C1[X(C7H13Cl2O4P)]
method: RPBEPBE
basis: SDD
operation: Freq
keyword: #p
keyword: freq=noraman
keyword: PBEPBE/SDD
title: #p freq=noraman PBEPBE/SDD
converged: YES YES NO NO
title: Mulliken charges:
elementType: Cl Cl P O O O O C C C C C C C H H H H H H H H H H H H H
charge: 0.032058 0.032172 1.400678 -0.547142 -0.487483 -0.499925 -0.585743 0.055442 -0.347028 -0.682806 -0.681804 -0.479285 0.149219 -0.385098 0.215664 0.214192 0.197379 0.221526 0.255628 0.212236 0.239160 0.212640 0.217141 0.246792 0.251669 0.247105 0.295612
chargesum: 0.00000
title: Mulliken charges with hydrogens summed into heavy atoms:
elementType: Cl Cl P O O O O C C C C C C C
charge: 0.032058 0.032172 1.400678 -0.547142 -0.487483 -0.499925 -0.585743 0.271106 0.064542 0.006584 -0.012863 0.266281 0.444832 -0.385098
polarizability: 1.63680768e+02 5.88798831e+00 1.12233441e+02 3.09417008e+00 -4.44757381e+00 1.29203667e+02
1716.lowfreq: -14.4696 -3.4756 0.0028 0.0034 0.0035 6.6535 10.5705 21.5937 24.6899
frequency: -10.0336 21.3888 24.4846 42.3810 61.3915 75.2728 90.6230 101.8565 120.6347 156.9255 159.1919 176.4214 209.8304 214.7527 221.0314 242.3195 269.7045 279.6721 322.8262 343.0476 355.7540 396.7557 413.2444 421.5721 444.4293 469.9147 576.5818 638.0823 669.2104 691.1930 783.7675 831.8548 839.2252 867.5840 879.2691 957.5946 960.9757 991.9188 1037.8897 1070.5547 1075.3054 1101.6598 1113.9999 1129.4959 1129.6777 1176.9991 1255.7190 1279.8529 1285.8813 1333.2953 1354.2702 1387.8747 1395.7331 1423.6841 1446.5024 1457.5183 1463.0846 1471.6441 1475.4887 1479.0559 1486.2782 1660.8623 2981.6432 2987.5795 2988.6635 2990.8532 3000.6703 3040.5143 3081.7890 3087.3219 3096.5319 3103.5996 3111.2467 3141.2624 3143.1524
redmass: 3.5555 5.9336 9.1772 5.2127 3.5809 3.2322 2.6767 1.6035 1.8810 13.6076 3.8903 3.4968 5.9100 1.1311 1.3183 4.8119 4.9221 8.1227 4.8524 5.8072 5.7750 5.0859 5.0950 4.9313 5.3330 3.1954 7.8375 6.8137 5.1059 7.9026 1.3479 2.3102 1.4405 3.9711 10.9917 4.3380 1.5894 1.3350 3.0802 11.4657 8.9867 1.8401 1.2348 1.8207 1.4380 2.0717 1.1952 1.1535 1.3145 1.2093 1.6326 1.2235 1.2093 1.1212 1.0759 1.0511 1.0533 1.0538 1.0458 1.0488 1.0488 8.5212 1.0630 1.0718 1.0421 1.0421 1.0286 1.1001 1.0997 1.0986 1.0998 1.1011 1.1061 1.0934 1.1050
irintensity: 0.2930 0.3586 0.4057 4.1483 7.0717 0.2069 0.3603 1.0665 1.0407 0.6258 0.5713 1.0875 3.8337 0.6786 1.0191 1.4226 2.7946 13.5189 11.8219 11.5436 6.6108 52.9422 35.0460 25.9933 17.4764 14.4420 8.5560 32.2351 147.4863 122.0592 8.8264 67.9585 55.8359 284.1595 195.0915 166.7342 16.5496 49.3097 12.3527 142.9067 418.9693 25.9691 0.9810 8.6034 2.8000 6.6842 0.8014 16.7753 1.0081 20.5376 3.3125 20.3718 16.9448 4.2994 4.7795 10.1016 10.3808 20.3245 12.0633 4.9688 17.8001 23.6533 9.9090 23.5386 17.9811 24.4827 31.7902 12.1544 38.6637 24.9462 42.3986 18.5687 20.6850 37.6754 9.6199
temp: 298.150 k
press: 1.00000 atm
elementType: 17 17 15 8 8 8 8 6 6 6 6 6 6 6 1 1 1 1 1 1 1 1 1 1 1 1 1
symmnumber: 1
zpe: 517802.6 jmol-1
zpe.correction: 0.197221 hartree
zpe.thermalcorrener: 0.215205 hartree
zpe.thermalcorrenthalpy: 0.216149 hartree
zpe.thermalcorrgfe: 0.148441 hartree
zpe.sumelectzpe: -1835.599769 hartree
zpe.sumelectthermal: -1835.581785 hartree
zpe.sumelectthermalent: -1835.580840 hartree
zpe.sumelectthermalfe: -1835.648548 hartree
dipole: 2.2154 -1.6324 2.9280
dipole: 4.0182
quadrupole: -106.5192 -102.1823 -105.6239
quadrupole: -7.3975 5.6196 8.4461
quadrupole: -1.7441 2.5928 -0.8487 -7.3975 5.6196 8.4461
hfenergy: -1835.7969896 hartree
pointgroup: C01 [X(C7H13Cl2O4P1)]
dipole: -0.357038 1.3190103 0.7949077 debye
polarizability: 146.9964069|3.2251199|123.2266821|-22.5150582|9.6268425|134.8947872 unknown
InChI: InChI=1S/C7H13Cl2O4P/c1-4-6(2)13-14(10,11-3)12-5-7(8)9/h5-6H,4H2,1-3H3
charge 0 multiplicity 1
27 atoms
Cl 2.984523 -1.247795 -3.674799
Cl 3.165697 0.945259 -1.558062
P  -0.693205 -1.183239 0.390495
O  -1.497196 0.188399 0.996148
O  0.012253 -1.82144 1.802803
O  0.63799 -0.373651 -0.472372
O  -1.442374 -2.2452 -0.510207
C  -2.142313 1.187475 0.044782
C  -3.576496 1.393671 0.553216
C  -1.273167 2.44709 0.055617
C  -4.460027 0.135205 0.442272
C  0.793508 -0.939237 2.713819
C  1.182359 -0.992368 -1.609281
C  2.297553 -0.494343 -2.189506
H  -2.162069 0.730051 -0.965926
H  -3.525502 1.739157 1.603828
H  -4.017207 2.223848 -0.034954
H  -1.232652 2.878657 1.071095
H  -0.246317 2.217852 -0.275321
H  -1.701206 3.204611 -0.626855
H  -4.040311 -0.694953 1.035819
H  -4.541835 -0.208178 -0.605607
H  -5.480399 0.338636 0.813023
H  1.096314 -1.606881 3.533039
H  0.159407 -0.119334 3.089172
H  1.679182 -0.538818 2.191022
H  0.658289 -1.867872 -2.01196
