program: Gaussian 09
title: 000214946
version: EM64L-G09RevD.01
frameworkgroup: C1[X(C18H26O)]
method: RPBEPBE
basis: SDD
operation: Freq
keyword: #pfreq=noraman
keyword: PBEPBE/SDD
title: #p freq=noraman PBEPBE/SDD
converged: NO YES NO NO
title: Mulliken charges:
elementType: O C C C C C C C C C C C C C C C C C C H H H H H H H H H H H H H H H H H H H H H H H H H H
charge: -0.418850 -0.159146 -0.203373 0.394743 -0.113087 -0.574587 -0.215241 -0.580051 -0.797522 -0.765395 -0.763579 0.439804 0.004138 -0.626752 0.324814 -0.588233 0.383564 -0.830931 -0.818260 0.237534 0.258603 0.195331 0.230866 0.240581 0.170348 0.226780 0.240352 0.213101 0.217998 0.215092 0.210451 0.211392 0.217985 0.211236 0.216838 0.217637 0.221679 0.251324 0.349038 0.222745 0.228240 0.222589 0.233233 0.223237 0.223735
chargesum: 0.00000
title: Mulliken charges with hydrogens summed into heavy atoms:
elementType: O C C C C C C C C C C C C C C C C C C
charge: -0.069813 0.078388 0.055230 0.394743 0.082244 -0.103140 -0.044893 -0.112918 -0.151332 -0.125567 -0.117868 0.439804 0.004138 -0.405073 0.324814 -0.336909 0.383564 -0.157357 -0.138055
polarizability: 2.56977671e+02 5.52285657e+00 1.85791613e+02 7.96216762e+00 2.19694322e+00 1.40422939e+02
1716.lowfreq: -10.4745 -0.0006 -0.0004 0.0004 2.9205 10.1914 22.2636 49.1551 58.5652
frequency: 18.3228 48.9198 58.1896 106.5840 119.1988 127.1905 150.5136 181.5434 193.1417 201.5457 210.4425 227.5018 252.8420 262.7616 287.5516 287.8271 304.3243 311.5363 314.2935 334.2915 362.7737 375.6635 405.1617 426.5879 451.9445 462.2836 479.7426 487.3138 533.2094 553.3032 589.8594 623.6042 653.3621 691.0019 728.4063 735.6803 743.4401 753.2062 808.9451 821.5298 878.7210 879.8198 886.0763 893.7314 915.0160 928.7473 936.2566 944.2177 957.7850 982.1099 988.5910 996.1613 999.2106 1011.8282 1022.9632 1028.2396 1049.1621 1052.8488 1062.0867 1071.1892 1101.3914 1113.4625 1122.1726 1133.2677 1142.9431 1177.5887 1183.3780 1195.2231 1200.4169 1210.1917 1217.4557 1242.8415 1256.6971 1270.8307 1272.9258 1278.1948 1301.9790 1304.3698 1310.2667 1338.7353 1345.6681 1374.3438 1384.8996 1389.2337 1392.7524 1397.0216 1405.4473 1415.8967 1462.3773 1462.5189 1463.6665 1471.3790 1473.7283 1474.9545 1475.7622 1480.7044 1484.0881 1486.8571 1495.3366 1496.9388 1506.3997 1577.2858 1638.3368 2912.6333 2952.8567 2964.0321 2965.7354 2968.1042 2972.6068 2978.3661 3017.4320 3020.2729 3033.5674 3040.3321 3040.6536 3054.9601 3056.4286 3060.5736 3064.2816 3066.2499 3069.8811 3076.1730 3076.5235 3080.4492 3084.1345 3085.6091 3123.9774 3148.9554 3567.0913
redmass: 3.7511 3.4921 3.6438 2.8548 1.2913 2.2129 1.1887 1.9004 2.5254 1.3814 2.7624 1.5322 2.0888 1.3564 2.3448 1.8253 1.9068 1.4299 2.5368 3.0395 2.7439 2.9292 2.6387 2.6313 4.1373 2.8420 2.7185 2.7232 3.2821 3.4920 3.2489 3.9486 3.2105 3.5633 4.3996 3.5377 4.1009 3.5773 2.9497 2.2163 1.4696 1.5840 2.0163 1.9264 2.6131 1.8916 2.0235 1.9019 1.7342 1.4696 1.8725 1.4142 1.4315 1.5196 1.4792 1.4338 2.1280 1.6246 1.5302 2.6967 1.4277 1.8472 1.4615 1.4539 2.0285 1.9629 2.5203 1.8554 2.0322 2.0858 1.7840 1.4402 1.5182 1.5158 1.3671 1.6522 3.0676 1.6615 1.8831 1.9245 1.3740 1.2070 1.2758 2.0465 1.2365 1.1993 1.2951 3.1546 1.0537 1.0486 1.0522 1.0679 1.1705 1.0535 1.0602 1.1757 1.0730 1.1133 1.2722 1.4467 1.2795 6.2028 6.7990 1.0829 1.0832 1.0376 1.0360 1.0381 1.0359 1.0369 1.0632 1.0616 1.0969 1.0968 1.0844 1.0991 1.0910 1.0979 1.0992 1.0976 1.0992 1.1015 1.0979 1.1027 1.0979 1.0999 1.0894 1.0918 1.0651
irintensity: 0.0972 0.0084 0.0778 0.0491 0.0309 0.1752 2.1295 0.1078 1.7312 0.0931 0.1730 0.9796 5.5172 0.1937 1.2706 0.0167 11.2290 78.7517 6.8994 2.4557 0.1698 0.4651 0.0459 1.7632 5.2258 4.7230 0.0898 2.9010 4.6264 0.2151 0.7460 0.0505 0.9096 3.8375 2.3495 1.2448 0.0753 0.8978 15.1151 1.7634 10.9113 13.7450 1.6603 5.7208 1.9843 3.6779 0.6840 2.3660 0.8290 0.8866 6.7321 6.6115 34.1729 2.8103 6.4157 13.7490 4.0168 0.1285 1.1710 18.0154 17.8038 11.8686 24.0570 51.2734 9.4363 15.3085 26.3279 0.8765 7.3853 35.3755 11.3673 2.1731 0.3409 2.0026 7.3528 0.5713 3.3814 1.5332 7.5801 17.3187 1.0333 13.2921 19.2026 3.2555 7.7775 17.7563 22.8591 3.0375 1.7881 0.4704 1.2829 18.5862 34.7207 29.7257 4.5234 5.2949 6.3176 5.9412 52.6986 17.3140 37.9952 15.8939 10.0136 36.9145 39.0169 62.8841 36.6319 36.2278 24.0290 47.8829 10.6890 36.8734 37.1579 9.7219 65.3077 9.6100 8.9989 51.0435 84.2423 11.3484 24.9573 21.2798 31.9848 92.0579 17.3016 29.2428 21.1941 7.4481 27.9831
temp: 298.150 k
press: 1.00000 atm
elementType: 8 6 6 6 6 6 6 6 6 6 6 6 6 6 6 6 6 6 6 1 1 1 1 1 1 1 1 1 1 1 1 1 1 1 1 1 1 1 1 1 1 1 1 1 1
symmnumber: 1
zpe: 1032270.3 jmol-1
zpe.correction: 0.393171 hartree
zpe.thermalcorrener: 0.412563 hartree
zpe.thermalcorrenthalpy: 0.413507 hartree
zpe.thermalcorrgfe: 0.346500 hartree
zpe.sumelectzpe: -775.284277 hartree
zpe.sumelectthermal: -775.264885 hartree
zpe.sumelectthermalent: -775.263941 hartree
zpe.sumelectthermalfe: -775.330948 hartree
dipole: 1.3880 -1.5244 -0.1985
dipole: 2.0712
quadrupole: -109.2139 -118.0337 -119.2888
quadrupole: 5.4119 2.6510 0.1399
quadrupole: 6.2982 -2.5216 -3.7767 5.4119 2.6510 0.1399
hfenergy: -775.6774479 hartree
pointgroup: C01 [X(C18H26O1)]
dipole: 0.5587213 0.2791825 -0.523335 debye
polarizability: 256.3524444|-12.187177|148.6977786|2.4672877|-17.3304805|178.1419998 unknown
InChI: InChI=1S/C18H26O/c1-10-6-16(17(19)7-11(10)2)15-9-13-8-14(15)12(3)18(13,4)5/h6-7,12-15,19H,8-9H2,1-5H3
charge 0 multiplicity 1
45 atoms
O  -1.231363 -1.393496 2.362319
C  2.315062 0.335698 -1.290033
C  1.328071 0.620452 0.738904
C  3.453635 -0.131703 -0.300486
C  2.73788 0.056446 1.122344
C  1.657997 1.501447 -0.496795
C  0.475413 -0.544199 0.092103
C  1.134217 -0.675842 -1.333367
C  3.89833 -1.601192 -0.508368
C  4.703358 0.765915 -0.505926
C  3.466365 0.947855 2.15036
C  -1.03163 -0.294532 0.13164
C  -1.796124 -0.718116 1.257179
C  -1.742024 0.385726 -0.889974
C  -3.131202 0.644369 -0.833928
C  -3.185032 -0.482165 1.334419
C  -3.869479 0.196123 0.303642
C  -3.820133 1.38147 -1.969629
C  -5.364552 0.438072 0.411237
H  2.707938 0.586837 -2.29126
H  0.81349 1.126616 1.573227
H  2.618953 -0.94646 1.585084
H  2.344089 2.334158 -0.266727
H  0.761314 1.915519 -0.989614
H  0.692945 -1.482951 0.649987
H  1.45132 -1.709321 -1.550418
H  0.427339 -0.386804 -2.130577
H  4.731019 -1.849993 0.177023
H  3.083391 -2.31973 -0.307673
H  4.254072 -1.77124 -1.542975
H  5.483846 0.553447 0.24713
H  5.142251 0.570478 -1.503045
H  4.468891 1.843588 -0.451471
H  4.47632 0.56403 2.384275
H  3.577682 1.988223 1.794583
H  2.896102 0.979656 3.097983
H  -1.194807 0.729322 -1.775464
H  -3.719598 -0.839258 2.220701
H  -0.258631 -1.518955 2.230633
H  -4.297302 2.318839 -1.622324
H  -3.103345 1.646924 -2.765749
H  -4.621576 0.771136 -2.430161
H  -5.769754 0.027931 1.351615
H  -5.60581 1.518337 0.381208
H  -5.913528 -0.032356 -0.427531
