program: Gaussian 09
title: 000214869
version: EM64L-G09RevD.01
frameworkgroup: C1[X(C14H23N)]
method: RPBEPBE
basis: SDD
operation: Freq
keyword: #pfreq=noraman
keyword: PBEPBE/SDD
title: #p freq=noraman PBEPBE/SDD
converged: YES YES NO NO
title: Mulliken charges:
elementType: N C C C C C C C C C C C C C C H H H H H H H H H H H H H H H H H H H H H H H
charge: -0.083516 -0.174014 -0.450747 -0.044409 -0.447458 0.476755 -0.700756 -0.713339 -0.382246 -0.447346 -0.629528 -0.618456 -0.250146 -0.227575 -0.249065 0.206438 0.202120 0.214936 0.192731 0.230897 0.198284 0.216379 0.209648 0.206725 0.209430 0.203264 0.230885 0.227245 0.232200 0.262417 0.186279 0.212837 0.223441 0.186363 0.220323 0.220598 0.222814 0.225591
chargesum: 0.00000
title: Mulliken charges with hydrogens summed into heavy atoms:
elementType: N C C C C C C C C C C C C C C
charge: -0.083516 0.032424 -0.033691 0.148322 -0.018276 0.476755 -0.068004 -0.069760 -0.155000 -0.215146 0.032005 0.011671 -0.029548 -0.004761 -0.023475
polarizability: 1.90032573e+02 -6.87938402e+00 1.36311691e+02 -6.96505915e-01 7.04585261e+00 1.39603016e+02
1716.lowfreq: -16.6392 -6.4450 -0.0008 -0.0007 -0.0006 1.3220 19.5657 33.0258 45.3555
frequency: 15.9637 32.8801 45.2133 57.8465 70.6497 92.8715 168.4006 190.9484 204.2623 219.8273 233.0675 252.0848 258.0135 280.3869 287.9799 341.1623 344.4435 363.1046 374.7432 404.2344 456.5095 478.7090 516.3101 553.8959 605.0288 616.6711 705.5521 757.4628 775.5977 790.3331 815.9165 851.2515 862.9720 913.0102 914.7681 952.4088 956.1259 964.0848 973.1306 985.8460 990.7255 992.6776 1020.0702 1027.3741 1034.3839 1053.4879 1078.3482 1086.9874 1116.6542 1121.7659 1139.4825 1166.9104 1170.5687 1188.2220 1190.1129 1205.9298 1218.5569 1254.8319 1262.9742 1272.7787 1306.3576 1310.2912 1331.3430 1341.8860 1357.4698 1365.3724 1375.6806 1382.5766 1392.8134 1416.9174 1439.9154 1442.1248 1458.6830 1460.7510 1463.0708 1466.4845 1474.2343 1477.3009 1478.9635 1481.3526 1485.4467 1487.1070 1495.3644 1589.6004 1610.0695 2834.2329 2845.9765 2862.0364 2948.0334 2964.0900 2966.0773 2972.2202 3007.6027 3014.1247 3024.4888 3030.3631 3041.0198 3059.8124 3060.6756 3067.9652 3069.3025 3073.9959 3104.6023 3111.6314 3115.4191 3130.2936 3139.9373 3159.5467
redmass: 3.0546 3.2329 2.9426 3.1896 2.9395 3.1890 2.6843 2.0079 3.1124 1.1676 1.2441 1.3711 3.0085 2.3905 1.0674 2.3610 2.1343 2.1002 2.0623 2.8131 2.3089 2.9499 2.7319 2.9126 3.3827 6.3811 1.7013 2.2173 3.0658 2.8348 3.1865 1.2553 1.9320 1.4543 1.2310 1.8898 1.6233 1.8491 1.4018 3.0892 1.4330 3.0376 2.2191 2.1137 1.6315 2.1159 1.6110 1.2607 1.7230 1.6420 1.7237 1.9881 1.0607 1.1624 1.8672 1.9009 1.2982 1.6721 1.7601 1.6456 1.4981 1.3904 1.4439 1.3254 1.4617 1.3186 1.2138 4.4853 1.2363 1.1436 1.4946 1.4962 1.0502 1.0730 1.0670 1.0526 1.0767 1.0633 1.2294 1.6681 1.0632 1.0547 1.0570 5.8999 6.0974 1.0682 1.0585 1.0583 1.0736 1.0500 1.0520 1.0417 1.0826 1.0718 1.0980 1.0752 1.0870 1.0995 1.0995 1.0987 1.0995 1.1007 1.0973 1.0863 1.0860 1.0908 1.0959 1.1013
irintensity: 0.1908 0.1610 0.2183 0.3216 0.1654 0.5081 0.2982 0.2679 0.0971 0.3203 0.5570 2.1873 0.8145 1.6072 0.4632 0.0800 8.0466 0.1757 0.6016 0.0012 0.1091 1.3596 0.7096 21.5209 4.4967 0.1562 49.8534 35.5902 4.3722 15.9764 7.3735 0.0837 4.5227 1.4016 2.4747 3.3854 3.3796 5.0554 0.1010 0.5074 0.4680 0.6405 9.1426 8.3303 21.9642 38.9384 11.4612 6.3401 2.9358 3.5238 8.0981 6.0526 0.1583 1.0065 5.2685 0.3812 1.0663 16.5431 5.9555 1.2804 2.0713 14.2030 4.7611 7.5236 0.3863 9.5801 16.1678 1.4110 16.9318 1.1920 3.3008 9.0111 14.5992 7.3659 1.6290 6.2966 20.5310 9.2736 12.1633 10.7873 10.0112 29.8802 14.6239 1.9080 13.5120 57.5351 71.3489 204.7505 12.4862 45.1499 54.8683 8.8541 22.3417 45.4984 25.8852 48.1705 39.6254 42.7591 1.6918 112.4192 51.1619 33.7925 22.3175 9.3163 4.2911 12.6172 46.6958 26.7866
temp: 298.150 k
press: 1.00000 atm
elementType: 7 6 6 6 6 6 6 6 6 6 6 6 6 6 6 1 1 1 1 1 1 1 1 1 1 1 1 1 1 1 1 1 1 1 1 1 1 1
symmnumber: 1
zpe: 883867.7 jmol-1
zpe.correction: 0.336647 hartree
zpe.thermalcorrener: 0.353538 hartree
zpe.thermalcorrenthalpy: 0.354482 hartree
zpe.thermalcorrgfe: 0.290637 hartree
zpe.sumelectzpe: -600.834743 hartree
zpe.sumelectthermal: -600.817853 hartree
zpe.sumelectthermalent: -600.816908 hartree
zpe.sumelectthermalfe: -600.880754 hartree
dipole: -0.2806 0.2117 0.7034
dipole: 0.7864
quadrupole: -90.1956 -93.7673 -91.1009
quadrupole: -0.0585 -1.6861 1.9407
quadrupole: 1.4923 -2.0793 0.5870 -0.0585 -1.6861 1.9407
hfenergy: -601.1713907 hartree
pointgroup: C01 [X(C14H23N1)]
dipole: 0.1371077 0.0689086 -0.2686455 debye
polarizability: 190.4877298|4.3838109|135.3093196|2.9173558|-6.5359137|140.1502314 unknown
InChI: InChI=1S/C14H23N/c1-12(2)10-14(11-15(3)4)13-8-6-5-7-9-13/h5-9,12,14H,10-11H2,1-4H3
charge 0 multiplicity 1
38 atoms
N  1.336164 2.280394 0.441303
C  0.668213 -0.141929 -0.037104
C  1.278821 -1.372305 -0.801283
C  2.459749 -2.097879 -0.089097
C  1.31391 1.182086 -0.553407
C  -0.859285 -0.170241 -0.134956
C  1.993865 -2.814732 1.202842
C  3.671679 -1.180179 0.203305
C  -1.522011 0.04632 -1.372931
C  -1.6525 -0.473216 1.002007
C  0.014227 2.892031 0.693471
C  2.348952 3.305171 0.110391
C  -2.929451 -0.026159 -1.467627
C  -3.061265 -0.549276 0.913254
C  -3.707395 -0.322926 -0.323893
H  0.944192 -0.216764 1.032288
H  1.608423 -1.041155 -1.808867
H  0.483005 -2.123428 -0.970551
H  2.802185 -2.885212 -0.795202
H  2.366238 0.968459 -0.811503
H  0.809959 1.49386 -1.506434
H  1.144597 -3.49363 0.999768
H  2.815909 -3.413463 1.637766
H  1.670901 -2.088683 1.972673
H  4.495776 -1.762197 0.657338
H  4.05978 -0.71268 -0.721656
H  3.404553 -0.372817 0.910817
H  -0.933699 0.26657 -2.272155
H  -1.157993 -0.6493 1.965881
H  -0.701175 2.131147 1.040979
H  -0.421316 3.377398 -0.217579
H  0.110612 3.661669 1.480674
H  3.344131 2.83403 0.018911
H  2.136312 3.854024 -0.843171
H  2.397471 4.051401 0.924137
H  -3.420192 0.146243 -2.432768
H  -3.65254 -0.782591 1.806423
H  -4.799401 -0.379143 -0.396641
