program: Gaussian 09
title: 000012434
version: EM64L-G09RevD.01
frameworkgroup: C1[X(C4H9NS)]
method: RPBEPBE
basis: SDD
operation: Freq
keyword: #pfreq=noraman
keyword: PBEPBE/SDD
title: #p freq=noraman PBEPBE/SDD
converged: YES YES NO NO
title: Mulliken charges:
elementType: S N C C C C H H H H H H H H H
charge: -0.070028 -0.017005 -0.183403 -0.622616 -0.590428 -0.710697 0.263130 0.234087 0.236288 0.227203 0.274127 0.223154 0.277390 0.229145 0.229653
chargesum: 0.00000
title: Mulliken charges with hydrogens summed into heavy atoms:
elementType: S N C C C C
charge: -0.070028 -0.017005 -0.183403 0.110889 0.134056 0.025490
polarizability: 9.40824605e+01 4.18807159e+00 6.64322962e+01 2.13893754e-01 1.36826351e-01 4.25000604e+01
1716.lowfreq: -49.8603 -14.3771 -0.0024 -0.0019 -0.0017 10.7137 16.2179 65.5955 114.1223
frequency: -49.0489 62.3609 114.1032 210.2387 279.9516 300.1667 387.2921 413.0998 481.2334 506.2762 632.2154 858.6958 1014.3811 1017.0642 1045.8321 1087.5602 1137.9358 1144.1026 1171.0191 1258.0906 1379.0876 1397.3082 1420.1090 1436.7824 1458.4261 1463.2256 1483.7695 1484.6781 1493.0880 1519.9002 2965.5802 2971.0872 2971.9099 3036.3316 3051.5790 3051.6664 3098.0515 3136.7105 3144.9364
redmass: 1.0406 1.2361 2.1094 1.1999 2.0240 4.2538 2.9356 2.7764 3.7871 3.5715 4.4200 2.6645 1.6370 1.5000 1.4526 1.2262 3.3347 1.5650 1.9402 5.6515 1.2138 1.7512 1.2309 1.1196 1.0501 1.0461 1.0463 1.0794 1.0458 1.5783 1.0362 1.0391 1.0384 1.1006 1.1002 1.0991 1.0995 1.0956 1.0941
irintensity: 0.1156 0.0952 0.4731 2.9074 6.9883 3.3859 1.1738 3.8724 3.4385 0.2366 1.6521 3.0115 62.1010 3.6185 5.5100 0.1742 17.7501 5.6006 81.6813 65.3135 20.8698 78.0747 42.5705 26.1926 11.0932 17.5375 33.1788 17.2092 1.8439 101.4387 29.5646 43.2585 95.3288 33.9463 54.0715 0.0932 3.1192 6.5057 10.7705
temp: 298.150 k
press: 1.00000 atm
elementType: 16 7 6 6 6 6 1 1 1 1 1 1 1 1 1
symmnumber: 1
zpe: 329486.5 jmol-1
zpe.correction: 0.125495 hartree
zpe.thermalcorrener: 0.132799 hartree
zpe.thermalcorrenthalpy: 0.133744 hartree
zpe.thermalcorrgfe: 0.093623 hartree
zpe.sumelectzpe: -610.136854 hartree
zpe.sumelectthermal: -610.129549 hartree
zpe.sumelectthermalent: -610.128605 hartree
zpe.sumelectthermalfe: -610.168726 hartree
dipole: 5.1289 1.3454 0.0036
dipole: 5.3024
quadrupole: -47.0545 -41.4427 -45.9486
quadrupole: -2.0048 -0.0311 -0.0385
quadrupole: -2.2392 3.3726 -1.1334 -2.0048 -0.0311 -0.0385
hfenergy: -610.2623486 hartree
pointgroup: C01 [X(C4H9N1S1)]
dipole: -1.7511783 -1.1336861 0.0005748 debye
dipolederiv: -0.6693908 -0.1389874 0.000341 -0.3447494 -0.6076434 0.0006434 0.0016363 -0.0007595 -0.2711277 -1.2629618 -0.244528 0.0043704 0.057017 -0.4349302 0.0081298 -0.0181266 -0.0150038 -0.2319503 1.5168221 0.4219804 0.0015797 0.2272613 0.6187535 -0.0020808 0.0057528 0.0061694 -0.134421 0.3171842 0.1741783 -0.0109511 0.311652 0.2242655 -0.0125202 0.0011351 -0.0060018 0.2647424 0.0422501 -0.0875186 -0.0016335 -0.361617 0.1462366 -0.00789 -0.005573 -0.0070761 0.254483 -0.0637038 0.0182754 -0.0023365 0.1496483 -0.2680678 -0.0025004 -0.0004875 -0.0099981 0.1357261 0.0852226 0.0997927 0.0159242 0.0341256 -0.0771586 -0.0139459 0.009518 -0.0129507 0.1127905 -0.0858962 -0.0641877 -0.0945859 -0.0134344 0.0689373 0.0620491 -0.1599537 -0.0041028 -0.0519112 -0.0676111 -0.0791179 0.085806 -0.0462559 0.0612133 -0.0406108 0.1629277 0.0310464 -0.0856603 -0.0263813 0.0703262 -0.10469 0.0554682 0.0754116 -0.0280806 -0.1458086 0.0332952 -0.0845811 0.166861 -0.174057 -0.0115748 -0.0169287 0.0362238 -0.0039642 -0.0034452 -0.0022119 0.1242506 -0.0448931 0.0690565 0.1155677 0.0418691 0.0822012 0.0401224 0.1521605 -0.0189022 -0.0672544 -0.0564712 0.0251996 -0.0068258 -0.0600745 0.1218437 -0.0007737 -0.0066256 0.0031525 0.1235798 0.069276 -0.0491599 0.0952421 -0.0196037 -0.0271953 0.0669606 0.0703606 0.1102525 -0.0389896 0.0796934 -0.0412526 -0.0862332 -0.0143778 -0.0200914 -0.0655387 -0.0634711 -0.106909 -0.0496767 unknown
polarizability: 88.8918731|11.581167|71.622995|-0.1351294|-0.1946265|42.499949 unknown
InChI: InChI=1S/C4H9NS/c1-4(6)5(2)3/h1-3H3
charge 0 multiplicity 1
15 atoms
S  1.778048 1.21759 -0.001626
N  -0.707348 0.070528 -0.004726
C  0.661394 -0.093971 0.0006
C  -1.677296 -1.041288 -0.005203
C  -1.334944 1.405599 0.004927
C  1.190664 -1.52367 0.0063
H  -1.17892 -2.014441 -0.096351
H  -2.37771 -0.927783 -0.854906
H  -2.270063 -1.035179 0.930717
H  -1.929797 1.554315 -0.916456
H  -0.542441 2.168382 0.05681
H  -2.004363 1.502024 0.880823
H  2.287292 -1.485807 0.043608
H  0.829897 -2.096298 0.882445
H  0.894087 -2.0745 -0.907662
