program: Gaussian 09
title: 000214913
version: EM64L-G09RevD.01
frameworkgroup: C1[X(C19H21F3N4O)]
method: RPBEPBE
basis: SDD
operation: Freq
keyword: #p
keyword: freq=noraman
keyword: PBEPBE/SDD
title: #p freq=noraman PBEPBE/SDD
converged: YES YES NO NO
title: Mulliken charges:
elementType: F F F O N N N N C C C C C C C C C C C C C C C C C C C H H H H H H H H H H H H H H H H H H H H H
charge: -0.168697 -0.167575 -0.167649 -0.255059 -0.108259 -0.262141 -0.077557 -0.035760 -0.394118 -0.327236 -0.329362 -0.276485 0.080192 0.132641 0.043440 0.428666 -0.669429 -0.666822 -0.269632 -0.528761 -0.355233 0.343807 -0.184193 -0.211478 -0.369446 -0.333068 0.251920 0.214944 0.221342 0.208085 0.189612 0.207046 0.193279 0.244718 0.227987 0.207976 0.230638 0.208969 0.208062 0.230689 0.208520 0.267461 0.311202 0.320071 0.233795 0.234690 0.262690 0.245516
chargesum: 0.00000
title: Mulliken charges with hydrogens summed into heavy atoms:
elementType: F F F O N N N N C C C C C C C C C C C C C C C C C C C
charge: -0.168697 -0.167575 -0.167649 -0.255059 -0.108259 -0.262141 -0.077557 -0.035760 0.042168 0.070461 0.070963 0.196220 0.080192 0.132641 0.043440 0.428666 -0.021846 -0.019551 -0.002171 -0.217559 -0.035162 0.343807 0.049602 0.023212 -0.106756 -0.087551 0.251920
polarizability: 3.08451269e+02 1.17166062e+01 3.18814644e+02 2.48047114e+00 -1.20987647e-02 1.39902450e+02
1716.lowfreq: -4.9519 -3.6694 -0.0006 -0.0003 0.0005 3.7317 11.4558 16.3542 20.4550
frequency: 11.1393 16.2621 20.4338 24.5237 30.2364 57.0142 63.5367 77.3225 80.9279 94.3652 122.0434 125.4338 148.8804 160.9428 176.5729 187.6218 215.2412 219.8802 227.2870 248.1592 253.1491 284.6082 302.3373 306.9600 331.3569 345.6404 358.2664 388.5039 392.1221 421.6315 431.9406 434.6561 451.0847 476.1305 489.3038 519.1490 569.5538 571.6459 579.8485 609.4278 629.5716 646.3028 646.7399 670.9129 706.2205 731.2518 744.6801 755.4672 778.0869 790.2230 794.6359 799.6014 808.6741 813.6476 828.7819 903.4290 916.2797 933.9197 936.8020 941.6525 959.7973 982.2850 984.8622 985.2662 991.1395 1009.5499 1015.1932 1021.8905 1051.5790 1061.3762 1062.3666 1066.0467 1076.6228 1079.6102 1085.3223 1096.5575 1118.3551 1122.2580 1148.5117 1162.9222 1190.0335 1203.0452 1209.2539 1232.2050 1255.9786 1275.8376 1286.8846 1293.7786 1295.2102 1312.5314 1319.7693 1350.6811 1360.5040 1364.4465 1368.3350 1370.7576 1385.6984 1388.7760 1389.7905 1394.4792 1397.8554 1451.8166 1460.6136 1462.2352 1467.7092 1470.4200 1472.1202 1479.5083 1483.5934 1485.2589 1486.5650 1490.3750 1498.5910 1549.7003 1596.2298 1608.8271 1622.2564 2856.6741 2865.5095 2910.7562 2982.2453 2985.2464 3007.5833 3021.2999 3034.0992 3052.2410 3074.1382 3077.6464 3085.1839 3092.7892 3094.0155 3139.4065 3148.0407 3159.8271 3169.9954 3178.3700 3181.2277 3195.6256
redmass: 3.3326 14.1142 5.1522 5.2220 5.3961 3.8310 3.2057 3.7777 2.3545 4.1134 2.9508 5.5592 4.2969 2.1954 4.2868 2.8947 2.0872 4.2560 1.7064 6.4687 3.9726 2.0036 2.3465 7.2020 4.0807 5.3627 5.4447 6.4254 6.5525 3.5952 4.7248 5.3193 2.8646 2.8375 4.8248 11.0766 4.6131 7.7623 7.0023 11.8922 6.5735 7.7183 7.5135 8.0878 2.2274 4.9069 6.0574 4.4168 2.9921 1.1585 1.1569 1.2987 1.7074 1.4543 4.9228 6.7202 2.0252 1.4648 1.4005 1.3990 8.0427 1.3623 6.9257 7.6276 2.2194 1.3464 5.7812 3.1625 3.4907 1.7011 3.0703 3.5374 2.0523 2.3822 2.1065 2.7569 1.8409 1.7539 1.5602 1.3738 1.1173 2.8968 2.2354 1.6666 2.1204 1.1152 1.2221 1.2715 3.0274 1.4182 1.3807 3.9254 1.3802 1.5309 3.9794 1.8185 2.1906 1.2339 1.2711 2.6874 6.0277 3.2463 1.1021 1.0540 1.2675 1.1305 2.0940 1.0650 2.5821 1.1017 1.0872 1.0945 5.0739 7.0231 6.6841 7.8107 6.2847 1.0719 1.0712 1.0703 1.0358 1.0359 1.0579 1.0878 1.0878 1.0904 1.0986 1.0983 1.1075 1.1004 1.1005 1.0897 1.0880 1.0910 1.0933 1.0991 1.0996 1.0923
irintensity: 0.0130 0.1715 0.4596 0.3724 0.0215 1.3016 0.5916 1.6100 0.0407 0.0881 0.8616 1.2218 0.2236 0.6688 3.3525 2.8192 0.4404 0.1193 0.4868 0.0511 8.5211 2.7091 0.6458 1.2318 3.4997 3.2150 7.5470 4.3500 8.1409 8.9828 0.1119 0.1607 8.3744 4.2641 1.1737 0.4246 5.0143 3.2604 1.6803 20.2509 1.2517 16.4241 5.1055 14.6534 24.8713 52.1716 9.5593 17.6430 29.3075 6.9081 6.1341 5.5498 38.9144 59.5038 3.1236 83.3689 16.0671 54.7425 5.1636 0.0464 107.1710 0.4038 89.7330 104.3330 6.2511 7.8623 132.4699 19.0423 58.4116 33.9335 10.3678 73.7221 9.7376 58.0709 2.3367 4.0263 7.4410 6.5998 30.0768 6.7464 14.1970 148.7783 41.1342 18.5297 91.1200 3.1922 34.2623 20.6097 203.7507 23.6867 57.6145 11.6007 5.3240 14.4851 57.1640 43.2728 38.6721 18.8853 45.9131 126.1927 7.9104 26.4280 30.6434 10.2894 32.5154 13.4901 52.9685 13.6647 16.2703 28.9473 29.5464 5.0860 568.1641 63.9866 43.1624 87.0957 78.7311 37.8481 176.3742 76.7759 29.5097 28.3382 13.4063 20.3267 16.2645 10.1852 50.7172 64.1990 40.2086 30.4837 48.5303 13.2208 8.8489 5.6232 4.4041 15.7744 17.4745 3.1864
temp: 298.150 k
press: 1.00000 atm
elementType: 9 9 9 8 7 7 7 7 6 6 6 6 6 6 6 6 6 6 6 6 6 6 6 6 6 6 6 1 1 1 1 1 1 1 1 1 1 1 1 1 1 1 1 1 1 1 1 1
symmnumber: 1
zpe: 979305.7 jmol-1
zpe.correction: 0.372998 hartree
zpe.thermalcorrener: 0.398761 hartree
zpe.thermalcorrenthalpy: 0.399706 hartree
zpe.thermalcorrgfe: 0.312492 hartree
zpe.sumelectzpe: -1328.364495 hartree
zpe.sumelectthermal: -1328.338731 hartree
zpe.sumelectthermalent: -1328.337787 hartree
zpe.sumelectthermalfe: -1328.425001 hartree
dipole: 3.1729 5.2370 -0.6105
dipole: 6.1535
quadrupole: -136.4366 -154.6939 -161.2712
quadrupole: -11.6115 -0.2035 1.5044
quadrupole: 14.3640 -3.8933 -10.4707 -11.6115 -0.2035 1.5044
hfenergy: -1328.737493 hartree
pointgroup: C01 [X(C19H21F3N4O1)]
dipole: 1.2940156 -1.9397566 0.6512091 debye
polarizability: 308.3806826|-9.9942384|313.7584585|14.3083021|-27.0074624|145.0292215 unknown
InChI: InChI=1S/C19H21F3N4O/c1-3-25(4-2)11-12-27-18-16-9-6-10-23-17(16)26(24-18)15-8-5-7-14(13-15)19(20,21)22/h5-10,13H,3-4,11-12H2,1-2H3
charge 0 multiplicity 1
48 atoms
F  -4.046755 4.115464 -0.547949
F  -1.797627 3.822643 -0.42304
F  -2.86544 3.594966 -2.406117
O  2.377561 -1.412734 0.325257
N  4.943302 1.311135 0.221969
N  -1.131733 -1.185879 -0.039213
N  0.15498 -0.585596 -0.020467
N  -2.048158 -3.471123 0.256753
C  4.397831 -0.065158 0.29155
C  6.216551 1.415993 -0.537597
C  4.977067 1.990571 1.545931
C  2.874076 -0.014384 0.134443
C  0.358383 -2.860454 0.376604
C  1.02338 -1.589578 0.227219
C  -1.036634 -2.562339 0.198699
C  -2.265481 -0.361119 -0.282159
C  6.018207 1.278496 -2.058965
C  4.872482 3.523812 1.440245
C  0.736168 -4.195674 0.633336
C  -2.068962 1.024234 -0.499052
C  -3.574207 -0.912083 -0.305289
C  -3.188419 1.847793 -0.733382
C  -0.297991 -5.153131 0.69693
C  -4.675878 -0.064714 -0.541381
C  -4.500282 1.317633 -0.758927
C  -1.651849 -4.750058 0.505475
C  -2.977237 3.308055 -1.012143
H  4.656091 -0.582555 1.244808
H  4.818332 -0.675585 -0.526598
H  6.648075 2.411687 -0.329357
H  6.967561 0.665069 -0.183199
H  4.117753 1.620292 2.136288
H  5.895982 1.711247 2.121072
H  2.582949 0.341297 -0.869558
H  2.396124 0.636169 0.890308
H  5.598459 0.293246 -2.333483
H  5.325274 2.056914 -2.422535
H  6.984401 1.3872 -2.586143
H  5.716423 3.957233 0.873856
H  3.937794 3.807047 0.926114
H  4.876894 3.981183 2.447282
H  1.785596 -4.46979 0.77568
H  -1.057045 1.432432 -0.472121
H  -3.706866 -1.983138 -0.135974
H  -0.078952 -6.206654 0.891832
H  -5.683909 -0.491457 -0.554361
H  -5.35833 1.973058 -0.933389
H  -2.457542 -5.490867 0.55435
