program: Gaussian 09
title: 000214833
version: EM64L-G09RevD.01
frameworkgroup: C1[X(C18H23N3)]
method: RPBEPBE
basis: SDD
operation: Freq
keyword: #pfreq=noraman
keyword: PBEPBE/SDD
title: #p freq=noraman PBEPBE/SDD
converged: YES YES NO NO
title: Mulliken charges:
elementType: N N N C C C C C C C C C C C C C C C C C C H H H H H H H H H H H H H H H H H H H H H H H
charge: -0.119906 -0.117877 -0.237934 -0.019022 -0.234463 -0.350785 -0.456089 0.229241 -0.393953 -0.462662 -0.424831 0.159645 -0.377520 -0.545804 0.171142 0.184616 -0.661076 -0.430558 -0.369012 -0.254124 -0.236267 0.215654 0.222024 0.234390 0.163022 0.205337 0.212214 0.174018 0.214808 0.236680 0.211416 0.216962 0.196335 0.192513 0.209275 0.215492 0.214319 0.231400 0.236977 0.245278 0.230960 0.232915 0.217403 0.217847
chargesum: 0.00000
title: Mulliken charges with hydrogens summed into heavy atoms:
elementType: N N N C C C C C C C C C C C C C C C C C C
charge: -0.119906 -0.117877 -0.237934 0.196632 -0.012439 0.046626 -0.038538 0.229241 -0.005127 -0.014565 -0.011534 0.159645 0.024268 -0.115993 0.171142 0.184616 0.052580 -0.199597 -0.136097 -0.036721 -0.018420
polarizability: 2.85772233e+02 -8.72205969e+00 2.09352666e+02 -1.80985316e+01 -1.37883646e+01 1.42189311e+02
1716.lowfreq: -6.9519 0.0002 0.0007 0.0007 10.0654 12.3815 35.2675 39.8003 78.8676
frequency: 35.0506 39.6258 78.8325 114.7252 129.0772 150.0439 156.1963 175.3445 178.4820 214.0499 248.2046 254.3756 265.2880 295.9810 310.4205 318.8214 373.5809 388.8922 416.0121 449.3306 456.7847 465.2526 502.5813 527.2458 546.2428 559.1164 577.3117 591.3588 591.8845 628.4124 678.3998 725.1271 746.6714 757.3083 781.1447 790.5559 810.2145 846.4146 847.6827 852.8286 862.5640 898.1617 917.0866 925.8794 939.5409 961.6219 966.4919 975.4113 1011.8112 1016.5095 1027.6909 1050.5281 1059.9238 1073.7452 1083.2739 1093.2367 1107.1293 1113.0676 1117.4575 1123.5469 1131.6647 1137.0962 1149.1411 1152.0874 1163.3832 1193.4525 1201.8483 1210.9177 1223.8019 1240.7113 1248.8157 1260.2517 1261.7843 1279.9046 1293.5510 1304.6423 1314.8415 1322.4703 1333.6892 1336.0643 1342.0854 1342.3795 1346.7839 1355.9663 1376.4598 1382.9421 1410.5687 1420.7651 1444.2796 1449.5638 1456.9069 1459.2573 1461.1726 1465.5197 1471.8101 1472.8199 1475.9033 1481.8752 1496.6633 1502.4440 1569.3005 1580.8699 1624.2161 2712.5944 2807.9536 2827.3712 2923.1191 2957.3398 2968.6452 2970.8189 2981.9179 2986.7608 2990.8055 2994.0090 3018.6512 3024.4303 3035.8917 3046.1272 3049.8853 3051.0234 3058.1853 3110.8613 3119.8743 3128.4896 3141.9324 3159.5560
redmass: 3.3385 3.9153 3.7526 2.3869 2.2931 1.3940 3.8150 3.2298 2.5629 3.0122 2.7879 2.9409 2.4399 3.6676 1.9113 4.5844 2.5907 4.0912 2.9052 2.8017 2.8832 4.1033 2.8760 3.5301 4.7707 4.1779 3.7548 4.3356 2.4987 3.6045 4.5149 4.8275 1.3358 3.9873 3.8991 3.0891 2.0545 1.6446 1.6758 2.4818 1.9403 2.7640 2.7085 1.3855 2.5886 1.7976 1.2976 3.1391 2.1564 2.3560 3.5930 2.4053 2.2356 1.7122 2.1323 1.8130 1.8934 1.9607 1.3187 1.4962 1.4831 2.0044 1.6158 1.3254 1.2484 1.8960 1.9090 2.0845 1.4066 1.9436 2.1594 1.2204 1.3818 1.6055 1.4644 1.3371 1.3512 1.5705 1.4400 1.6768 1.4023 1.4391 1.5157 1.6305 2.0178 1.6163 4.5126 3.0492 1.7572 1.1012 1.0866 1.0961 1.1299 1.0969 1.2934 1.6890 1.0877 3.3363 1.1589 1.0892 7.8963 6.7668 7.4830 1.0710 1.0793 1.0710 1.0832 1.0632 1.0626 1.0383 1.0608 1.0640 1.0619 1.0854 1.0949 1.0879 1.0958 1.1003 1.1018 1.1041 1.1036 1.0972 1.0845 1.0887 1.0950 1.1001
irintensity: 0.5121 0.0703 0.4739 0.6689 1.8936 2.3615 1.3613 1.8884 0.0802 2.3195 0.3117 1.7894 4.3011 2.7981 1.7206 0.5629 1.1747 4.3141 4.8306 2.9950 6.1568 3.7009 3.1221 3.7441 2.6652 0.2039 0.7578 2.6059 0.5303 3.1701 5.7510 2.0420 97.1776 0.8541 0.5721 1.7138 2.6208 1.4826 1.1856 6.7732 2.4547 14.8165 4.3731 2.4167 7.7311 5.4484 0.0171 8.5129 6.6416 14.2167 3.2528 8.2144 5.9080 2.3286 8.4629 12.7054 3.8173 16.6342 0.9332 13.6799 13.5482 48.1332 8.0282 3.2386 0.6742 32.8954 4.6353 9.6992 1.5592 19.6246 8.5422 8.4631 25.0516 14.1626 2.4644 5.7073 22.8795 35.9214 3.4689 0.0920 13.4210 0.5455 13.4700 13.1854 22.3336 8.8083 43.9641 9.9893 2.2388 12.6724 13.4007 12.8201 6.7260 6.3996 3.9011 22.7113 12.2381 46.6201 9.4465 6.1628 3.9902 0.5245 1.7203 114.3356 41.7110 136.1536 62.7175 49.0832 38.0450 62.6716 36.6949 31.5041 35.7276 73.5386 55.3157 72.6092 60.0325 32.7916 15.5068 57.9811 74.5447 9.5747 1.4435 3.5913 38.8584 38.6536
temp: 298.150 k
press: 1.00000 atm
elementType: 7 7 7 6 6 6 6 6 6 6 6 6 6 6 6 6 6 6 6 6 6 1 1 1 1 1 1 1 1 1 1 1 1 1 1 1 1 1 1 1 1 1 1 1
symmnumber: 1
zpe: 989410.2 jmol-1
zpe.correction: 0.376846 hartree
zpe.thermalcorrener: 0.394429 hartree
zpe.thermalcorrenthalpy: 0.395373 hartree
zpe.thermalcorrgfe: 0.331954 hartree
zpe.sumelectzpe: -862.403464 hartree
zpe.sumelectthermal: -862.385881 hartree
zpe.sumelectthermalent: -862.384937 hartree
zpe.sumelectthermalfe: -862.448356 hartree
dipole: -1.7422 -1.3315 -0.5044
dipole: 2.2501
quadrupole: -126.4009 -113.1696 -129.0147
quadrupole: -0.5748 4.9749 -6.7816
quadrupole: -3.5391 9.6922 -6.1530 -0.5748 4.9749 -6.7816
hfenergy: -862.7803101 hartree
pointgroup: C01 [X(C18H23N3)]
dipole: 0.679296 0.5403558 -0.1738437 debye
polarizability: 286.5992202|-9.3141345|206.7596236|13.9031707|19.0748954|143.9553657 unknown
InChI: InChI=1S/C18H23N3/c1-19-15-7-3-2-6-13(15)14-9-11-21-12-20-10-5-4-8-16(20)18(21)17(14)19/h2-3,6-7,16,18H,4-5,8-12H2,1H3
charge 0 multiplicity 1
44 atoms
N  3.201964 -0.505248 -0.033554
N  1.444245 -1.728479 0.838457
N  -1.209258 1.032371 0.801366
C  2.030929 0.404217 -0.11089
C  1.034033 -0.274534 0.889532
C  2.626659 -1.858412 -0.048354
C  2.474924 1.847183 0.174218
C  -0.413537 -0.100432 0.512915
C  4.248106 -0.206386 -1.025506
C  0.393828 -2.75207 0.658724
C  3.601236 2.249022 -0.814262
C  -1.177962 -1.047413 -0.174063
C  4.766907 1.229653 -0.792151
C  -0.625648 -2.416862 -0.476323
C  -2.501942 -0.49098 -0.345091
C  -2.490903 0.812685 0.273534
C  -0.830443 2.2225 1.562875
C  -3.70167 -0.957308 -0.943117
C  -3.631823 1.644466 0.296871
C  -4.84421 -0.132021 -0.919678
C  -4.809706 1.155369 -0.307228
H  1.567187 0.366642 -1.13445
H  1.232021 0.129906 1.906173
H  3.350046 -2.597109 0.3469
H  2.336237 -2.178441 -1.094522
H  2.850002 1.907049 1.215123
H  1.621391 2.542972 0.071802
H  3.85836 -0.295264 -2.074955
H  5.071416 -0.936672 -0.912952
H  -0.169092 -2.860443 1.605296
H  0.900486 -3.715588 0.463363
H  3.974933 3.262055 -0.572888
H  3.180236 2.298307 -1.840115
H  5.514997 1.485672 -1.566645
H  5.272755 1.264969 0.191522
H  -1.432078 -3.175805 -0.496639
H  -0.119225 -2.461042 -1.462725
H  -0.745598 3.114845 0.912993
H  -1.584597 2.429926 2.344037
H  0.139794 2.059924 2.056142
H  -3.739411 -1.943456 -1.420317
H  -3.614032 2.636816 0.761074
H  -5.775811 -0.479767 -1.380357
H  -5.713146 1.775781 -0.307732
