program: Gaussian 09
title: 000214909
version: EM64L-G09RevD.01
frameworkgroup: C1[X(C21H23F3N4O)]
method: RPBEPBE
basis: SDD
operation: Freq
keyword: #p
keyword: freq=noraman
keyword: PBEPBE/SDD
title: #p freq=noraman PBEPBE/SDD
converged: YES YES NO NO
title: Mulliken charges:
elementType: F F F O N N N N C C C C C C C C C C C C C C C C C C C C C H H H H H H H H H H H H H H H H H H H H H H H
charge: -0.169558 -0.167994 -0.164839 -0.254445 -0.072307 -0.265907 -0.079628 -0.035623 -0.401649 -0.368580 -0.370796 -0.393095 -0.410157 -0.402804 -0.403470 -0.272045 0.131736 0.084700 0.042910 0.428217 -0.271291 -0.479694 -0.406365 0.331863 -0.183092 -0.332097 -0.185872 -0.375085 0.244822 0.200725 0.212124 0.213961 0.175413 0.203259 0.197686 0.210787 0.200486 0.203952 0.196093 0.202385 0.195687 0.210445 0.233234 0.238365 0.226294 0.266916 0.341771 0.290193 0.233842 0.249563 0.235439 0.263522
chargesum: 0.00000
title: Mulliken charges with hydrogens summed into heavy atoms:
elementType: F F F O N N N N C C C C C C C C C C C C C C C C C C C C C
charge: -0.169558 -0.167994 -0.164839 -0.254445 -0.072307 -0.265907 -0.079628 -0.035623 0.011200 0.020794 0.030149 0.018179 -0.010111 -0.004731 0.040209 0.192614 0.131736 0.084700 0.042910 0.428217 -0.004375 -0.137923 -0.116172 0.331863 0.050751 -0.082535 0.049567 -0.111563 0.244822
polarizability: 3.54032918e+02 -8.84240295e+00 3.16903131e+02 5.22398728e+00 3.79276399e+00 1.52823346e+02
1716.lowfreq: -20.2179 -4.8548 -2.3416 -0.0009 0.0004 0.0011 8.1679 10.8717 16.4652
frequency: -15.0149 9.7109 16.3855 16.7257 26.2657 44.5883 60.6175 71.4989 79.3472 116.2050 128.6238 137.4443 142.9832 159.5810 176.5266 196.4341 219.3835 238.2748 247.4007 249.6868 273.5806 306.6369 311.4685 314.0136 342.0862 347.0934 380.4263 390.7739 401.1263 416.9522 428.5091 430.7120 435.3591 485.0763 487.9648 510.1834 521.8394 569.6761 573.3325 583.2940 608.6272 628.5119 646.2036 650.2745 674.9324 704.4073 705.7323 730.5781 752.0994 778.1205 786.3155 799.4842 807.2556 808.3909 811.3755 830.5168 836.1272 854.5685 905.3436 928.4594 942.3380 945.5331 954.1657 956.2652 957.7205 980.8115 982.0587 984.8294 985.8456 989.0414 996.5378 1017.1839 1020.6051 1032.4244 1040.5788 1064.8948 1076.6766 1082.8339 1095.7808 1102.6300 1108.7347 1119.0194 1134.2543 1147.7626 1150.8009 1174.5225 1183.4269 1200.6940 1204.3357 1215.4197 1241.0257 1264.0745 1264.8749 1273.8225 1286.9167 1300.1550 1304.8361 1312.5330 1322.6407 1333.4289 1338.5791 1346.4594 1347.8877 1354.9761 1359.1674 1364.1205 1374.0319 1379.4617 1393.0783 1395.8493 1399.9722 1450.1174 1452.3789 1456.3244 1460.4836 1461.8483 1462.2230 1468.3809 1476.3168 1485.4638 1486.4056 1490.9968 1502.8778 1550.2800 1597.9124 1608.3451 1620.9749 2841.7204 2909.7036 2957.5179 2958.8507 2961.1613 2968.0109 2975.1192 2991.7141 3004.8441 3016.1328 3020.4126 3028.8252 3031.3446 3040.0838 3041.7990 3080.8651 3141.6760 3148.8845 3159.4855 3166.3467 3174.0328 3181.2599 3191.9319
redmass: 3.8694 3.6871 10.6210 5.6006 6.2879 4.7562 3.7594 5.0443 6.9821 2.8046 7.0154 2.6580 4.0989 3.2392 4.6834 5.8496 5.0422 3.1104 2.5433 5.9545 6.7943 6.6229 3.9659 2.6792 4.9309 4.7397 2.6438 6.7049 5.6980 2.6520 4.4670 3.0648 5.1958 1.5243 4.9435 2.8538 8.8828 4.5980 7.4733 5.6922 12.3249 6.2016 7.5120 7.5237 7.5479 3.3118 2.1913 7.4931 7.7807 3.0257 1.2454 3.3321 1.3806 1.6337 1.5812 2.3038 4.5783 1.5502 8.6673 1.3871 1.3968 2.0475 6.2862 2.2419 1.6086 1.5996 1.3645 5.7875 5.7795 2.3029 1.3552 6.1979 3.2588 2.0416 4.0651 3.2465 1.9183 2.8004 2.1361 2.1355 2.2118 2.4132 1.5301 1.5586 1.6276 1.4254 1.1052 1.2585 3.0775 1.3895 1.4244 2.0829 1.3227 1.1678 2.5261 1.2677 1.2710 1.4194 1.4305 1.3758 1.4365 1.3104 4.3962 1.4480 1.6304 1.3616 2.9624 2.1718 5.1436 3.2720 1.9587 3.8241 1.0867 1.0883 3.0110 1.1113 1.0824 1.1326 1.1924 1.0823 2.6107 1.1150 4.1547 7.0584 6.7803 7.7947 6.1992 1.0720 1.0691 1.0605 1.0662 1.0645 1.0621 1.0726 1.0781 1.0578 1.0947 1.1009 1.0972 1.0997 1.0910 1.1013 1.1085 1.0895 1.0881 1.0912 1.0940 1.0951 1.0996 1.0957
irintensity: 0.0164 0.0203 0.1249 0.0820 0.3418 0.4286 1.3670 1.1936 0.8216 3.2768 0.3101 0.4228 0.0319 1.1718 3.7687 4.0795 0.1824 2.5444 0.3867 0.0228 0.7269 0.0886 10.7875 1.9408 11.1877 2.3936 0.9555 1.5747 6.9073 2.9981 0.4393 17.3147 0.3542 1.0668 1.2104 4.1604 1.8392 5.2264 2.0263 1.5106 23.4831 1.3944 5.9155 11.8957 20.8442 9.2716 25.5982 55.5112 7.9102 32.4787 0.2038 1.3799 3.7708 4.3067 88.2258 10.5153 21.2754 0.4317 128.2602 2.1208 0.4018 18.8480 7.2947 5.7098 104.8687 7.3294 0.4581 54.4955 113.3022 0.7246 4.9817 147.6575 24.3663 11.9831 160.4804 26.7356 7.3057 8.3103 34.9523 29.2572 29.0953 3.4877 5.6042 72.7053 25.8020 10.1005 1.5351 0.7341 15.7295 10.0653 5.1157 125.6565 40.0494 1.7105 216.6069 35.5287 7.8645 44.3804 51.6735 4.9470 0.9884 4.9524 56.2021 0.2318 27.2493 0.7215 18.4440 66.8698 86.4975 20.1852 22.5854 115.5720 10.0277 9.1097 4.7227 17.3304 12.4192 82.8396 83.4454 6.4662 96.1339 3.3817 448.7681 77.3974 27.8459 92.4738 87.7893 94.7924 56.2953 13.4807 46.7208 31.5755 26.0092 11.8629 68.2077 15.5899 89.0759 37.0733 58.4419 45.6418 16.7400 76.9066 35.5331 10.5313 9.3861 5.9185 21.5579 5.9137 18.0403 1.9684
temp: 298.150 k
press: 1.00000 atm
elementType: 9 9 9 8 7 7 7 7 6 6 6 6 6 6 6 6 6 6 6 6 6 6 6 6 6 6 6 6 6 1 1 1 1 1 1 1 1 1 1 1 1 1 1 1 1 1 1 1 1 1 1 1
symmnumber: 1
zpe: 1076183.2 jmol-1
zpe.correction: 0.409897 hartree
zpe.thermalcorrener: 0.435092 hartree
zpe.thermalcorrenthalpy: 0.436036 hartree
zpe.thermalcorrgfe: 0.350676 hartree
zpe.sumelectzpe: -1405.630807 hartree
zpe.sumelectthermal: -1405.605611 hartree
zpe.sumelectthermalent: -1405.604667 hartree
zpe.sumelectthermalfe: -1405.690028 hartree
dipole: -7.6000 1.5805 0.2131
dipole: 7.7655
quadrupole: -190.0113 -146.8569 -172.5077
quadrupole: 7.2554 0.1108 0.0050
quadrupole: -20.2193 22.9351 -2.7158 7.2554 0.1108 0.0050
hfenergy: -1406.0407035 hartree
pointgroup: C01 [X(C21H23F3N4O1)]
dipole: -3.0017225 -0.5381723 -0.1847047 debye
polarizability: 354.4609532|8.4213914|312.3391091|-2.3377655|26.2136825|156.9593328 unknown
InChI: InChI=1S/C21H23F3N4O/c22-21(23,24)16-7-5-8-17(15-16)28-19-18(9-6-10-25-19)20(26-28)29-14-13-27-11-3-1-2-4-12-27/h5-10,15H,1-4,11-14H2
charge 0 multiplicity 1
52 atoms
F  6.972001 2.34511 -0.362503
F  6.806359 0.939492 1.403539
F  6.59533 0.130882 -0.700295
O  -1.812792 -1.496048 -0.119714
N  -4.953173 0.491797 0.342704
N  1.561848 -0.443775 -0.043144
N  0.173059 -0.164134 0.05467
N  2.962868 -2.446498 -0.447977
C  -5.242189 1.289886 -0.875472
C  -6.070489 0.217309 1.282584
C  -6.573982 0.986654 -1.623451
C  -7.090388 1.367983 1.439381
C  -7.776263 1.778666 -1.055147
C  -8.213473 1.368941 0.37054
C  -4.086382 -0.684039 0.120231
C  -2.611599 -0.262515 0.153887
C  -0.451442 -1.346242 -0.137453
C  0.478745 -2.424903 -0.361767
C  1.773278 -1.804851 -0.294173
C  2.486855 0.624984 0.119459
C  0.40874 -3.813328 -0.606464
C  3.880989 0.39119 0.016531
C  1.996615 1.930054 0.384549
C  4.765782 1.477824 0.179024
C  1.631646 -4.497652 -0.768454
C  2.863081 -3.784003 -0.682343
C  2.903254 2.996452 0.541487
C  4.294821 2.785101 0.4431
C  6.245484 1.227024 0.122038
H  -4.391264 1.133464 -1.565502
H  -5.232676 2.369747 -0.620866
H  -5.617183 -0.001361 2.270266
H  -6.641907 -0.701023 0.989429
H  -6.780355 -0.103221 -1.605747
H  -6.445022 1.264342 -2.68891
H  -6.559746 2.340244 1.459171
H  -7.565297 1.253325 2.433489
H  -8.645037 1.670377 -1.734998
H  -7.50948 2.856557 -1.058092
H  -9.023275 2.051718 0.697589
H  -8.657978 0.352204 0.337748
H  -4.296503 -1.209488 -0.840344
H  -4.256618 -1.419949 0.927015
H  -2.331434 0.141753 1.142858
H  -2.37211 0.493615 -0.616865
H  -0.55346 -4.330376 -0.666461
H  4.246875 -0.617182 -0.193018
H  0.918369 2.084901 0.458422
H  1.65336 -5.574024 -0.960266
H  3.814947 -4.31157 -0.807487
H  2.52005 4.002126 0.741735
H  4.998655 3.614361 0.556867
