program: Gaussian 09
title: 000214820
version: EM64L-G09RevD.01
frameworkgroup: C1[X(C14H16N4O3)]
method: RPBEPBE
basis: SDD
operation: Freq
keyword: #p
keyword: freq=noraman
keyword: PBEPBE/SDD
title: #p freq=noraman PBEPBE/SDD
converged: YES YES NO NO
title: Mulliken charges:
elementType: O O O N N N N C C C C C C C C C C C C C C H H H H H H H H H H H H H H H H
charge: -0.190025 -0.266262 -0.280103 -0.074641 -0.058982 -0.590736 -0.590326 -0.280795 -0.302295 -0.206547 -0.276733 -0.092630 -0.106355 0.245516 0.265294 -0.151903 -0.152013 -0.228454 -0.209515 0.208514 0.229833 0.293341 0.258366 0.295626 0.277074 0.337465 0.337097 0.304769 0.304054 0.300818 0.297694 0.306741 0.305281 0.359276 0.385027 0.359008 0.387522
chargesum: 2.00000
title: Mulliken charges with hydrogens summed into heavy atoms:
elementType: O O O N N N N C C C C C C C C C C C C C C
charge: -0.190025 -0.266262 -0.280103 -0.074641 -0.058982 0.153567 0.156205 0.270911 0.270405 0.130918 0.060364 0.212139 0.197700 0.245516 0.265294 0.148915 0.145681 0.078286 0.095766 0.208514 0.229833
polarizability: 1.86293745e+02 2.14696647e+01 2.09444127e+02 4.72643398e+00 3.26941617e-02 1.40968535e+02
1716.lowfreq: -1.8211 -0.0005 -0.0002 0.0005 6.1775 8.5991 28.5773 36.7113 51.1679
frequency: 28.4651 36.6778 51.1638 53.9179 70.8698 92.7081 110.4762 140.3344 147.2611 154.3729 167.3211 178.7033 260.2196 289.2262 308.7682 336.4260 353.9775 373.9342 387.7325 393.4872 418.6376 463.6729 472.4075 513.3752 523.8459 543.4013 547.4260 591.7820 595.1436 597.6480 615.8059 677.7800 686.0021 691.8565 696.2973 714.6101 724.3785 739.4864 743.4213 817.4609 826.1822 844.3222 867.2783 884.6836 916.6719 942.6430 951.2170 961.8190 966.8192 1006.7532 1010.3103 1016.0587 1018.9413 1037.5608 1048.7212 1064.5372 1065.8705 1110.6821 1119.2604 1127.9301 1143.6973 1166.3486 1175.1629 1208.1476 1211.1985 1218.1137 1248.7943 1324.2956 1336.2296 1365.1639 1372.9281 1376.9640 1381.0673 1384.3621 1399.6479 1431.4899 1433.9680 1466.1894 1478.7173 1486.1413 1488.1334 1563.3404 1564.4631 1575.3215 1581.3321 1618.6752 1619.7749 1652.1628 1656.7331 3038.8690 3043.8468 3097.6684 3119.7247 3144.5478 3167.2927 3175.6896 3184.7320 3190.4111 3190.4396 3205.7359 3206.1719 3502.5475 3503.8126 3643.1381 3643.2566
redmass: 5.3912 5.1789 6.3856 5.9983 5.9380 4.8773 7.8625 6.0421 4.9691 4.7208 4.7499 3.8768 4.8623 4.2739 3.9297 4.2786 5.6502 3.4438 3.3219 2.8044 2.2034 3.8036 3.9469 3.2204 1.9701 1.3886 1.6658 4.0274 3.9925 4.3489 4.0014 1.8888 1.9188 2.0296 1.9192 5.2091 4.7893 2.6781 2.4397 2.0537 1.5684 2.7996 4.8812 4.5846 1.5849 1.5391 1.4212 1.5977 2.2707 1.8884 2.1928 2.5300 2.0014 2.5866 2.0343 1.8131 1.8143 2.0503 1.8939 1.9164 1.8211 3.3396 3.8479 1.1472 1.1522 1.2009 1.1798 1.3114 1.3298 1.5418 1.9730 3.2128 2.2026 1.8353 5.1133 1.7012 1.8278 1.4156 1.5968 2.0244 1.6823 5.0035 5.2065 3.0968 2.9407 3.7474 3.5175 1.7629 1.8757 1.0589 1.0624 1.1006 1.1116 1.1084 1.0935 1.0930 1.0945 1.0939 1.0933 1.1017 1.1017 1.0476 1.0476 1.1039 1.1040
irintensity: 1.0073 1.6195 4.6682 2.7644 31.3633 5.3746 3.9015 1.5345 8.4912 22.3057 4.7959 2.8277 1.9020 6.4902 3.3256 2.5492 16.8377 0.7820 3.4432 2.7801 0.8945 4.2986 4.6847 7.0056 2.6588 49.3885 19.9751 8.7297 6.7002 53.7171 5.5677 228.2462 32.9418 20.2273 26.4301 6.2295 4.2705 234.0772 70.9950 34.6175 42.1898 0.4654 46.6325 28.6339 25.9857 7.6243 16.8600 44.4197 103.9400 3.1370 3.8214 9.4740 2.8662 93.5396 6.6497 5.4601 6.5885 3.8385 5.8137 19.6445 35.6973 60.1237 55.5318 0.6570 1.3455 14.4391 4.4156 0.5676 0.5837 7.2854 4.7018 21.8459 67.1516 65.2925 103.7478 20.1572 17.8148 17.1950 39.5730 16.1279 17.8842 0.1813 5.8935 107.5143 34.1583 12.5948 20.3455 364.1932 428.9246 6.2967 8.9667 115.7125 0.0878 0.5054 0.4058 0.6275 6.1105 7.7363 3.9087 8.7244 10.5780 91.8000 214.0707 82.6196 43.5284
temp: 298.150 k
press: 1.00000 atm
elementType: 8 8 8 7 7 7 7 6 6 6 6 6 6 6 6 6 6 6 6 6 6 1 1 1 1 1 1 1 1 1 1 1 1 1 1 1 1
symmnumber: 1
zpe: 772100.9 jmol-1
zpe.correction: 0.294078 hartree
zpe.thermalcorrener: 0.312987 hartree
zpe.thermalcorrenthalpy: 0.313931 hartree
zpe.thermalcorrgfe: 0.245871 hartree
zpe.sumelectzpe: -985.689334 hartree
zpe.sumelectthermal: -985.670425 hartree
zpe.sumelectthermalent: -985.669481 hartree
zpe.sumelectthermalfe: -985.737541 hartree
dipole: -1.3545 -2.4301 1.6126
dipole: 3.2157
quadrupole: -24.7256 -47.1006 -99.9171
quadrupole: -1.7206 4.5587 5.1095
quadrupole: 32.5222 10.1471 -42.6693 -1.7206 4.5587 5.1095
hfenergy: -985.9834113 hartree
pointgroup: C01 [X(C14H16N4O3)]
dipole: -0.3152051 1.1824508 -0.3209717 debye
polarizability: 180.2068438|-15.0499924|209.4819673|-6.61159|21.2025657|147.0175956 unknown
InChI: InChI=1S/C14H16N4O3/c15-13(19)11-3-1-5-17(7-11)9-21-10-18-6-2-4-12(8-18)14(16)20/h1-8H,9-10,15-16H2
charge 2 multiplicity 1
37 atoms
O  -0.028933 2.833483 1.256126
O  -0.337067 -1.847368 -1.181861
O  1.032454 -2.049848 1.666126
N  -1.803791 1.220635 1.14563
N  1.983924 1.669191 0.517731
N  -2.425136 -2.877023 -1.368793
N  2.771433 -3.126703 0.535606
C  -0.88424 1.963819 2.07024
C  1.413253 2.756322 1.399302
C  -1.430614 -0.00199 0.639095
C  2.035647 0.396268 1.023243
C  -2.970377 1.843114 0.739155
C  2.292241 1.920155 -0.80576
C  -2.220343 -0.640547 -0.335861
C  2.329301 -0.705614 0.204528
C  -3.80469 1.221692 -0.196906
C  2.658096 0.859142 -1.645912
C  -3.43152 -0.02935 -0.746626
C  2.660592 -0.470495 -1.152515
C  -1.594549 -1.860786 -0.993304
C  2.016774 -2.041695 0.853361
H  -1.496705 2.610162 2.718327
H  -0.320881 1.236424 2.679804
H  1.791402 3.729927 1.056255
H  1.732643 2.559447 2.43789
H  -0.515279 -0.479833 1.013388
H  1.800601 0.251672 2.080442
H  -3.190371 2.821984 1.171106
H  2.222217 2.955151 -1.148311
H  -4.726499 1.722672 -0.501678
H  2.90662 1.073343 -2.688121
H  -4.066211 -0.495865 -1.507159
H  2.876268 -1.30122 -1.831158
H  -3.411751 -2.921353 -1.111187
H  -2.025593 -3.683999 -1.854302
H  3.607129 -3.078566 -0.048224
H  2.533052 -4.030044 0.953023
