program: Gaussian 09
title: 000214801
version: EM64L-G09RevD.01
frameworkgroup: C1[X(C12H11NO2S)]
method: RPBEPBE
basis: SDD
operation: Freq
keyword: #p
keyword: freq=noraman
keyword: PBEPBE/SDD
title: #p freq=noraman PBEPBE/SDD
converged: YES YES NO NO
title: Mulliken charges:
elementType: S O O N C C C C C C C C C C C C H H H H H H H H H H H
charge: 0.251626 -0.402337 -0.227034 -0.037005 -0.264494 0.296224 -0.380266 -0.583927 0.509259 -0.777224 -0.377684 -0.362482 0.223734 -0.221580 -0.229363 -0.238047 0.251372 0.257912 0.239992 0.250072 0.243381 0.275023 0.230747 0.230255 0.228749 0.231769 0.381328
chargesum: 0.00000
title: Mulliken charges with hydrogens summed into heavy atoms:
elementType: S O O N C C C C C C C C C C C C
charge: 0.251626 -0.021009 -0.227034 -0.037005 -0.264494 0.296224 -0.380266 -0.074643 0.509259 -0.043779 -0.102661 -0.131735 0.223734 0.008675 -0.000614 -0.006279
polarizability: 2.65903112e+02 9.61743894e+00 1.61495150e+02 -1.29385927e+01 9.12892781e+00 8.33562914e+01
1716.lowfreq: -11.8614 -3.9115 -0.0015 -0.0012 0.0012 2.4080 20.4952 34.7156 36.3385
frequency: 20.0968 34.6130 36.3125 50.7076 71.2926 101.3662 108.4850 164.6570 220.6124 225.6421 286.6084 304.0660 346.1983 393.7430 399.7012 417.8341 469.5798 499.7652 530.6242 569.9572 589.5594 611.3267 633.2392 645.7910 656.2350 667.1824 694.7833 752.2857 777.1506 838.6698 842.2133 852.2328 914.0250 933.5676 962.6627 983.3997 987.3867 1001.4393 1002.3622 1027.0421 1044.1946 1086.0885 1089.2823 1158.1646 1173.0336 1189.6485 1200.3202 1236.2246 1283.2089 1313.1549 1318.6690 1322.2406 1382.3765 1403.6171 1434.6806 1446.4060 1456.4408 1461.8375 1474.9663 1514.2347 1548.3397 1583.2036 1610.7027 1662.2459 2992.3075 3036.6792 3073.9116 3103.3743 3113.0454 3123.4894 3132.6059 3145.9469 3160.8538 3171.6119 3510.0436
redmass: 6.0853 6.0644 5.2225 7.3490 1.0438 6.3163 4.7139 5.6739 4.3456 3.8606 7.2685 3.7216 6.2057 2.9812 2.8208 3.4349 4.3038 4.4870 4.8733 2.9631 4.6292 6.3037 2.4553 3.6073 7.1119 3.9530 1.7706 5.4022 1.8426 4.0105 4.5085 1.2553 5.1297 1.4385 2.3812 1.3762 5.9394 1.9627 1.3328 2.0713 1.5009 1.6323 2.2359 3.4068 1.0568 1.1269 1.3875 3.0684 1.4254 3.2727 1.8981 1.8414 7.5609 1.2526 2.4121 1.0971 1.0922 2.5836 1.0971 5.5838 5.0832 6.0591 6.0073 8.6296 1.0378 1.0590 1.0976 1.1037 1.0989 1.0866 1.0875 1.0927 1.0963 1.0999 1.0640
irintensity: 0.4062 1.1650 0.6374 0.7256 0.1616 1.0043 0.8260 1.4485 1.8498 1.0266 0.3997 5.2174 1.0089 4.4125 0.0071 2.2200 2.0743 13.6154 47.7815 37.6691 1.1358 5.2922 57.3354 37.1037 45.8797 39.6874 50.4929 9.3732 58.3291 23.4203 1.6773 0.1180 48.6350 5.8509 12.6092 0.2583 1.0929 27.1805 0.5543 5.0657 6.5352 58.0618 149.3338 4.5057 0.2263 6.7415 19.3155 18.0728 3.6933 13.4228 58.4558 7.0091 0.0727 24.0555 14.8822 21.0545 9.7444 42.5705 9.9911 8.5813 40.8626 0.7638 0.6932 266.5789 20.9895 11.6482 12.1544 2.1993 8.6304 7.2945 1.4961 22.2781 20.8060 20.9898 24.9849
temp: 298.150 k
press: 1.00000 atm
elementType: 16 8 8 7 6 6 6 6 6 6 6 6 6 6 6 6 1 1 1 1 1 1 1 1 1 1 1
symmnumber: 1
zpe: 529835.4 jmol-1
zpe.correction: 0.201804 hartree
zpe.thermalcorrener: 0.216949 hartree
zpe.thermalcorrenthalpy: 0.217894 hartree
zpe.thermalcorrgfe: 0.156350 hartree
zpe.sumelectzpe: -1066.005492 hartree
zpe.sumelectthermal: -1065.990346 hartree
zpe.sumelectthermalent: -1065.989402 hartree
zpe.sumelectthermalfe: -1066.050946 hartree
dipole: -0.4457 -1.4150 -0.4704
dipole: 1.5563
quadrupole: -89.8958 -94.9999 -100.3302
quadrupole: -3.7085 -4.2723 -2.5247
quadrupole: 5.1795 0.0754 -5.2549 -3.7085 -4.2723 -2.5247
hfenergy: -1066.2072956 hartree
pointgroup: C01 [X(C12H11N1O2S1)]
dipole: -0.146804 -0.5434945 -0.2407762 debye
polarizability: 265.0963439|15.324608|160.1922461|-9.548687|16.2141704|85.4659629 unknown
InChI: InChI=1S/C12H11NO2S/c1-8-10(7-11(14)15)16-12(13-8)9-5-3-2-4-6-9/h2-6,14H,7H2,1H3
charge 0 multiplicity 1
27 atoms
S  0.610192 -1.099348 -0.764394
O  4.024604 -1.825122 0.66956
O  4.750165 0.352237 1.043639
N  -0.040988 1.362309 0.023491
C  1.890333 0.167998 -0.615585
C  1.34482 1.376839 -0.184915
C  -0.605296 0.185757 -0.21896
C  3.334596 -0.152684 -0.92851
C  -2.03427 -0.118209 -0.082248
C  2.100674 2.655039 0.070806
C  -2.92036 0.916724 0.334706
C  -2.562895 -1.410101 -0.352874
C  4.117529 -0.467626 0.344765
C  -4.297897 0.659341 0.474861
C  -3.942841 -1.661973 -0.211472
C  -4.817063 -0.629501 0.20266
H  3.814596 0.718351 -1.404775
H  3.406587 -1.010606 -1.616054
H  1.774788 3.444468 -0.630869
H  1.888041 3.017319 1.092084
H  3.189725 2.51808 -0.017416
H  -2.503317 1.907358 0.540301
H  -1.896394 -2.220244 -0.673114
H  -4.969769 1.462887 0.79621
H  -4.336774 -2.661989 -0.423088
H  -5.889098 -0.826864 0.312053
H  4.494712 -1.99684 1.530639
