program: Gaussian 09
title: 000214773
version: EM64L-G09RevD.01
frameworkgroup: C1[X(C6H11NO2)]
method: RPBEPBE
basis: SDD
operation: Freq
keyword: #p
keyword: freq=noraman
keyword: PBEPBE/SDD
title: #p freq=noraman PBEPBE/SDD
converged: YES YES NO NO
title: Mulliken charges:
elementType: O O N C C C C C C H H H H H H H H H H H
charge: -0.214426 -0.228043 0.114555 -0.033312 -0.487703 -0.689529 -0.709761 -0.061759 -0.218410 0.211043 0.223739 0.217322 0.222206 0.212328 0.218243 0.223181 0.215756 0.220809 0.280577 0.283184
chargesum: 0.00000
title: Mulliken charges with hydrogens summed into heavy atoms:
elementType: O O N C C C C C C
charge: -0.214426 -0.228043 0.114555 0.177731 -0.046642 -0.036752 -0.050015 0.218818 0.064774
polarizability: 1.15805283e+02 -8.28404234e+00 7.83303641e+01 -7.72788806e+00 -2.93077413e+00 6.01979484e+01
1716.lowfreq: -9.2250 -5.4895 -0.0009 -0.0002 0.0006 10.5501 33.1317 60.8097 85.9166
frequency: 33.0759 60.5243 85.9047 143.0881 192.7506 220.0716 244.5780 267.2896 337.6474 364.2659 387.2997 474.2302 558.8329 663.1500 675.2100 778.5410 829.8914 871.3836 914.8499 930.3262 953.3156 967.0454 989.6375 1023.8815 1097.7651 1143.9709 1184.9868 1202.6185 1224.2203 1241.0516 1271.0391 1289.6387 1329.9423 1347.5689 1380.6313 1389.2897 1399.6938 1454.3017 1466.6715 1473.2023 1484.7768 1489.2036 1645.2159 2960.9288 2972.9669 2975.8584 2982.3546 3038.1938 3066.4838 3071.6691 3072.6931 3077.0100 3125.2688 3192.5104
redmass: 5.4763 2.8819 4.5380 3.1028 2.2863 1.3216 1.0525 3.1173 3.1073 2.1269 2.3393 4.1460 2.7866 5.4373 5.9298 3.1860 1.8436 1.8810 1.3738 2.1691 1.5888 1.8907 1.2549 1.7439 1.5891 2.0132 2.1450 1.4163 4.3819 1.5288 1.3990 1.3765 1.5055 1.4180 1.2137 4.3677 1.2310 1.1112 1.0440 1.0532 1.0466 1.0523 6.1074 1.0636 1.0354 1.0381 1.0811 1.0978 1.1002 1.0993 1.0994 1.0989 1.0899 1.0962
irintensity: 0.0279 0.5915 1.0229 2.5533 1.1769 0.5645 0.1252 0.2362 0.6771 0.2150 1.2416 0.3265 9.6279 8.3893 8.0111 0.7413 24.2980 25.0852 2.6812 2.5069 5.7963 0.2346 43.9629 3.4952 14.3865 9.8898 37.8205 16.9936 194.0192 5.7825 21.8499 3.8368 1.2080 7.6031 17.5511 107.6232 25.3022 16.7112 1.7004 5.6153 18.7771 14.1178 62.5834 14.2746 34.9642 17.7185 30.0344 21.4860 23.7608 36.5748 22.1608 87.3486 0.8662 4.9144
temp: 298.150 k
press: 1.00000 atm
elementType: 8 8 7 6 6 6 6 6 6 1 1 1 1 1 1 1 1 1 1 1
symmnumber: 1
zpe: 430766.4 jmol-1
zpe.correction: 0.164070 hartree
zpe.thermalcorrener: 0.174464 hartree
zpe.thermalcorrenthalpy: 0.175408 hartree
zpe.thermalcorrgfe: 0.127234 hartree
zpe.sumelectzpe: -439.612625 hartree
zpe.sumelectthermal: -439.602231 hartree
zpe.sumelectthermalent: -439.601287 hartree
zpe.sumelectthermalfe: -439.649462 hartree
dipole: -5.4252 -1.1748 1.6110
dipole: 5.7799
quadrupole: -68.1252 -55.8415 -53.9409
quadrupole: -1.7236 2.0821 0.1475
quadrupole: -8.8227 3.4611 5.3617 -1.7236 2.0821 0.1475
hfenergy: -439.7766955 hartree
pointgroup: C01 [X(C6H11N1O2)]
dipole: -2.1494323 0.4629311 -0.5802763 debye
dipolederiv: -0.7980021 -0.2611187 -0.0368195 -0.1253594 -0.5487433 0.0530555 -0.1093831 0.0133278 -0.2752044 -0.5333669 0.0454707 -0.0721568 0.1080996 -0.7529713 0.1450482 -0.1021572 0.1542832 -0.2928187 1.4683223 0.120488 0.2290215 -0.1969132 1.0430859 -0.2385748 0.3674659 -0.1977868 0.3538441 0.3663924 -0.001774 -0.0202565 0.1274266 0.1490398 0.017974 -0.182885 0.0021695 0.1709243 -0.33961 0.035517 -0.0022957 -0.1100346 0.1035984 -0.0382476 0.0093897 0.0195539 0.0028193 -0.0035894 -0.0192245 0.0118389 -0.0615941 0.0010131 -0.0700137 0.0321696 -0.0539339 -0.0465058 0.019222 -0.0432375 0.0429027 -0.0224538 -0.0705885 0.0236877 0.0657756 0.0130793 0.0279156 0.6305321 -0.026846 0.148963 0.1326147 0.0159717 0.0283018 0.254931 -0.0316752 -0.0814013 -0.7731024 0.1223238 -0.1257209 -0.0709547 0.0778254 -0.0698547 -0.149672 -0.0221654 -0.1412213 -0.1611986 0.0637147 -0.089975 0.0663642 -0.007521 0.0490869 -0.0580285 0.0469434 -0.0341242 0.0242174 -0.0128246 -0.0615425 0.0691141 0.0329708 -0.1111388 -0.0598477 -0.0845562 -0.0649794 0.0010544 -0.064069 0.0286441 -0.0044066 -0.1357862 0.0935274 0.0085649 0.0386846 0.0759462 -0.0488637 0.0584525 -0.1134739 0.0856811 0.0338661 0.0491516 -0.0973499 0.0100353 0.0256612 0.0862943 -0.073266 -0.003904 -0.0484928 -0.1671444 0.0152734 -0.0143051 0.0637802 0.0582436 -0.0891066 0.0045642 0.1403386 -0.0223887 0.1002594 0.0082555 0.1459066 -0.0170585 -0.0239861 -0.1139357 -0.0436197 0.1183687 -0.0112058 0.0753961 0.0094607 0.1455727 0.0333916 0.0206174 0.1089609 -0.0115434 -0.0162042 -0.0164733 -0.0235942 -0.0980079 -0.0510937 -0.1416684 -0.103611 -0.0351923 0.0954967 -0.1114546 0.05054 0.0314407 0.0380345 -0.1077105 0.0570908 0.0253879 0.1369438 0.0112786 -0.025944 0.0109045 0.0146944 0.0414607 -0.0420109 0.0528298 0.1295918 0.0540279 0.0002174 -0.04033 0.0395321 0.027187 0.0535199 -0.0553326 0.0436748 0.1729008 unknown
polarizability: 116.1696628|8.190543|78.3135348|6.3061945|-3.1619645|59.850398 unknown
InChI: InChI=1S/C6H11NO2/c1-6(2)4-3-5-7(8)9/h3,5-6H,4H2,1-2H3
charge 0 multiplicity 1
20 atoms
O  3.414969 0.679449 0.133049
O  2.376101 -1.340966 0.409384
N  2.378343 -0.094968 0.065286
C  -2.499314 0.22627 -0.083276
C  -1.297275 0.368949 -1.077799
C  -2.263734 1.040787 1.209899
C  -2.827937 -1.252217 0.233697
C  -0.001816 -0.194305 -0.559142
C  1.144536 0.520076 -0.438141
H  -3.373405 0.661736 -0.609878
H  -1.561868 -0.178486 -2.007358
H  -1.170934 1.433924 -1.349741
H  -1.40113 0.644925 1.777892
H  -2.062254 2.105389 0.986903
H  -3.151037 0.994306 1.867502
H  -3.761284 -1.321399 0.821765
H  -2.966558 -1.846642 -0.689037
H  -2.029042 -1.728428 0.831929
H  0.029619 -1.253283 -0.267498
H  1.276222 1.574481 -0.688834
