program: Gaussian 09
title: 000214964
version: EM64L-G09RevD.01
frameworkgroup: C1[X(C20H25N5O5P2)]
method: RPBEPBE
basis: SDD
operation: Freq
keyword: #p
keyword: freq=noraman
keyword: PBEPBE/SDD
title: #p freq=noraman PBEPBE/SDD
converged: YES YES NO NO
title: Mulliken charges:
elementType: P P O O O O O N N N N N C C C C C C C C C C C C C C C C C C C C H H H H H H H H H H H H H H H H H H H H H H H H H
charge: 1.219752 1.280363 -0.550651 -0.596722 -0.553984 -0.590324 -0.281276 -0.431015 -0.411185 -0.415365 -0.548738 -0.681050 -0.393818 -0.368673 -0.385798 -0.384418 -0.382681 -0.379737 0.366752 -0.449512 0.387494 -0.203064 -0.326988 -0.374817 0.415135 -0.332191 -0.336938 0.275857 -0.491301 0.051923 -0.152817 -0.540672 0.262156 0.253874 0.250337 0.269159 0.266523 0.256940 0.255414 0.267368 0.262862 0.256895 0.259058 0.269988 0.256318 0.254285 0.298917 0.304091 0.257520 0.279683 0.263066 0.221236 0.310654 0.310292 0.214750 0.215433 0.249638
chargesum: 0.00000
title: Mulliken charges with hydrogens summed into heavy atoms:
elementType: P P O O O O O N N N N N C C C C C C C C C C C C C C C C C C C C
charge: 1.219752 1.280363 -0.550651 -0.596722 -0.553984 -0.590324 -0.281276 -0.431015 -0.411185 -0.415365 -0.548738 -0.060103 0.122212 0.150823 0.137666 0.138365 0.137076 0.149309 0.366752 0.061090 0.387494 0.095852 -0.022896 -0.117297 0.415135 -0.052508 -0.073872 0.275857 -0.270065 0.051923 0.061933 -0.075601
polarizability: 3.34584761e+02 -8.44831643e+00 3.71803009e+02 -1.31324061e+01 -2.88301551e+01 3.09397796e+02
1716.lowfreq: -5.3421 -2.1577 0.0011 0.0012 0.0014 3.8379 6.8595 9.1812 14.1912
frequency: 0.9940 8.8812 14.0993 18.9713 25.4685 31.5928 37.4424 44.0301 48.4984 59.8479 60.8018 70.4641 79.5649 88.4962 95.0262 104.2866 117.5026 135.3996 144.5153 155.8613 169.2008 183.6808 189.1456 202.8828 210.2670 240.1495 246.3841 247.7005 261.6765 267.7116 274.6017 293.5403 306.0225 331.7449 343.1654 355.7274 363.2463 369.3977 377.1438 384.7201 417.0312 420.3094 427.3520 434.9675 458.5870 466.0272 487.3554 491.0358 506.1539 511.5885 530.2040 537.4245 563.4138 569.9674 581.9072 624.6329 637.7236 654.4929 667.6280 712.4071 764.2625 777.8700 782.6956 792.6844 805.8298 806.0991 806.3822 807.2742 810.2674 822.3906 825.3499 838.0894 848.7109 876.7681 881.8520 883.1489 901.3528 910.3417 932.7678 951.0293 968.3559 976.4403 986.6405 995.1793 995.4094 999.0128 999.1043 1002.7561 1004.8530 1025.6631 1029.9872 1055.8758 1058.4147 1073.1621 1076.2794 1079.4828 1080.1589 1104.3586 1116.6930 1119.1074 1122.6380 1124.3470 1125.8446 1128.1711 1149.1982 1151.4093 1153.3238 1155.1427 1166.5808 1203.9240 1206.0104 1236.7331 1248.9351 1251.0168 1260.4973 1275.8983 1281.3205 1294.3164 1314.7207 1352.9675 1362.6884 1392.1340 1404.0262 1412.3976 1416.9309 1448.4934 1450.5502 1453.9387 1463.7623 1465.8406 1469.6357 1476.7563 1485.4266 1501.2722 1586.9135 1592.1042 1603.2959 1634.8664 1637.0914 1664.3785 2924.1613 3024.7565 3083.0514 3087.2924 3088.2686 3089.3050 3094.0316 3095.8951 3096.1560 3132.5181 3145.4941 3152.6926 3155.9505 3168.9019 3170.3402 3177.3689 3192.5818 3194.0250 3195.3271 3209.1091 3210.9971 3211.2694 3211.8946 3555.0423 3694.6160
redmass: 5.2063 6.2727 5.4430 4.9999 3.5745 3.8405 4.3979 4.7946 4.8243 5.6248 3.8871 3.3622 4.1110 2.6388 5.4436 5.4074 3.1781 3.2142 4.7583 4.8169 3.5187 5.0013 4.4354 4.4765 7.2010 6.6830 5.6337 3.9850 5.8105 2.0029 2.2197 3.8845 4.0607 5.7143 3.5519 5.1218 5.3308 5.6583 5.9933 4.8158 3.0588 5.3580 1.4084 6.4717 6.4189 2.8273 2.3971 4.9703 4.7174 4.3268 5.1687 3.7851 9.4852 6.1347 2.6597 9.3258 7.8863 11.5529 3.9094 3.9098 4.6371 8.8163 2.5874 5.6988 1.3141 1.1402 1.1109 1.3567 5.5755 1.2728 8.9216 7.1128 1.5832 3.0878 1.8192 4.5148 4.7331 4.8097 4.4502 1.3530 1.3389 2.4983 1.4336 1.0656 1.0869 1.0989 1.1225 2.8335 2.1450 8.7951 2.8010 1.9235 3.4524 1.2747 1.2972 1.5261 1.2776 1.2938 1.3207 1.3312 1.3226 1.2776 1.2853 1.2790 1.4056 1.3991 2.1099 1.6139 1.3987 3.5888 1.9103 3.2582 1.5638 1.9973 3.5954 2.9973 1.3971 1.2700 1.3817 2.8674 7.5869 2.4252 1.5757 3.4818 2.0636 1.0754 1.0799 1.0776 1.1704 1.1687 1.1777 2.3118 1.1668 5.6499 8.0055 6.7641 6.2548 4.6676 1.2632 4.5127 1.0681 1.0927 1.0489 1.0500 1.0493 1.0612 1.0583 1.0592 1.0585 1.0937 1.0904 1.0897 1.0891 1.0972 1.0921 1.0976 1.1182 1.1190 1.1191 1.1177 1.1157 1.1184 1.1184 1.0452 1.1036
irintensity: 0.8841 0.0070 2.5454 0.3613 1.6501 2.7620 1.4555 2.6174 1.6770 2.0726 1.6290 4.8724 1.6872 0.3030 12.3915 0.5251 0.4005 0.2965 0.4875 12.9935 1.2974 0.4762 8.1481 5.9565 7.9502 7.4522 4.7156 13.4215 15.4763 65.1087 33.3197 16.4247 21.9570 13.1480 57.1725 14.9844 9.4084 6.3316 15.9609 6.2306 0.8904 19.6242 123.6334 11.4890 51.5451 18.1648 1.0786 26.9948 41.8828 22.2824 145.1332 2.0647 229.2036 128.8094 32.5475 48.7994 17.0714 11.9471 20.7607 0.1514 59.5937 63.0083 56.2365 567.9873 13.9357 6.2638 20.1521 23.6775 14.9207 3.7227 8.7911 10.0288 92.0980 77.6327 8.7178 124.9275 241.1015 170.6516 21.1465 0.3450 4.6408 147.4830 21.8174 3.9048 1.1114 6.6796 52.2199 43.1001 46.2944 79.6210 66.6354 83.0775 194.9237 5.7306 8.9097 14.5999 7.2736 9.7302 9.5189 9.4892 5.8656 12.8261 7.7596 17.1549 1.8788 3.8581 318.3315 113.1282 23.7282 25.0925 158.2984 53.0404 55.0491 34.9195 78.9475 113.5350 25.4793 1.7178 1.8091 13.9985 1.4634 3.1733 78.4393 1.8817 51.1716 8.7370 8.0684 7.2988 4.5833 0.3530 3.3152 376.6155 9.0611 293.3019 4.4055 306.9561 9.5675 6.1587 28.2233 298.2094 74.5827 6.0808 11.6079 15.5514 13.8365 18.0423 9.1109 20.4119 21.4079 4.0370 32.0309 0.3184 4.6325 1.9839 4.8079 1.5972 0.6075 2.0128 1.0964 7.8285 12.6153 17.1859 12.6752 72.2213 22.2854
temp: 298.150 k
press: 1.00000 atm
elementType: 15 15 8 8 8 8 8 7 7 7 7 7 6 6 6 6 6 6 6 6 6 6 6 6 6 6 6 6 6 6 6 6 1 1 1 1 1 1 1 1 1 1 1 1 1 1 1 1 1 1 1 1 1 1 1 1 1
symmnumber: 1
zpe: 1128788.5 jmol-1
zpe.correction: 0.429933 hartree
zpe.thermalcorrener: 0.464457 hartree
zpe.thermalcorrenthalpy: 0.465401 hartree
zpe.thermalcorrgfe: 0.354479 hartree
zpe.sumelectzpe: -2106.874402 hartree
zpe.sumelectthermal: -2106.839878 hartree
zpe.sumelectthermalent: -2106.838934 hartree
zpe.sumelectthermalfe: -2106.949856 hartree
dipole: 0.0814 1.7719 0.3757
dipole: 1.8131
quadrupole: -192.4559 -178.5846 -195.2621
quadrupole: -6.8608 21.1801 27.2485
quadrupole: -3.6884 10.1829 -6.4945 -6.8608 21.1801 27.2485
hfenergy: -2107.3043349 hartree
pointgroup: C01 [X(C20H25N5O5P2)]
dipole: -0.0425696 0.7076459 -0.079228 debye
polarizability: 335.3681381|7.4946617|365.8009133|-11.9941264|34.6103625|314.6165137 unknown
InChI: InChI=1S/C20H25N5O5P2/c1-2-20(26)16-13-17(21)15-25(14-16)32(28,24-11-12-24)30-19-5-3-18(4-6-19)29-31(27,22-7-8-22)23-9-10-23/h2-6,13-14H,1,7-12,15,21H2
charge 0 multiplicity 1
57 atoms
P  5.094237 0.118987 -0.490205
P  -2.508913 -2.252821 -1.195262
O  3.504416 0.745354 -0.025358
O  5.108885 -0.729647 -1.8437
O  -1.330785 -2.155108 0.12002
O  -2.002218 -2.754649 -2.616121
O  -3.527119 1.648341 2.216445
N  6.071902 1.562337 -0.483195
N  5.630744 -0.687772 1.006675
N  -3.759262 -3.237312 -0.457368
N  -3.167161 -0.619006 -1.272832
N  -3.310767 1.918243 -3.955393
C  5.622526 2.850929 -1.122267
C  5.788689 2.758941 0.389102
C  5.303081 -2.170197 1.145042
C  6.726172 -1.738278 0.860654
C  -3.442766 -4.536105 0.247684
C  -3.978532 -3.35235 1.037099
C  2.312147 -0.026685 -0.044178
C  -3.611876 -0.101598 -2.594674
C  -0.115744 -1.413571 0.0070
C  -3.325062 0.156328 -0.123941
C  2.016298 -0.945306 -1.080151
C  1.396437 0.209861 1.005918
C  -3.438113 1.411855 -2.662507
C  0.794325 -1.651939 -1.046416
C  0.165058 -0.476524 1.024596
C  -3.543926 1.521734 -0.200048
C  -3.489789 2.170635 -1.516556
C  -3.700163 2.239944 1.091798
C  -4.077408 3.690584 1.05353
C  -4.143684 4.438475 2.186994
H  4.598889 2.903775 -1.51111
H  6.388578 3.33921 -1.731188
H  6.679147 3.176683 0.867836
H  4.877547 2.741184 0.996102
H  4.755171 -2.65804 0.329926
H  5.006972 -2.454706 2.15835
H  7.463524 -1.708426 1.66738
H  7.118631 -1.932269 -0.144891
H  -2.389208 -4.800986 0.393633
H  -4.107174 -5.360272 -0.026637
H  -5.032612 -3.320312 1.327618
H  -3.277436 -2.839123 1.70385
H  -4.679491 -0.36715 -2.758174
H  -3.017781 -0.611786 -3.376389
H  -3.22407 -0.329946 0.849979
H  2.733976 -1.105578 -1.890905
H  1.651384 0.93207 1.786665
H  0.545035 -2.371407 -1.832908
H  -0.569119 -0.29227 1.81503
H  -3.399282 3.259547 -1.583047
H  -3.192272 1.297325 -4.750855
H  -3.192592 2.916393 -4.110246
H  -4.329174 4.135217 0.083578
H  -4.439463 5.49316 2.171231
H  -3.900307 3.979331 3.152791
