program: Gaussian 09
title: 000214756
version: EM64L-G09RevD.01
frameworkgroup: C1[X(C10H11Cl2NO)]
method: RPBEPBE
basis: SDD
operation: Freq
keyword: #p
keyword: freq=noraman
keyword: PBEPBE/SDD
title: #p freq=noraman PBEPBE/SDD
converged: YES YES NO NO
title: Mulliken charges:
elementType: Cl Cl O N C C C C C C C C C C H H H H H H H H H H H
charge: -0.059925 -0.075291 -0.267063 -0.353297 -0.544295 -0.375628 0.496165 -0.392400 -0.410159 -0.086865 -0.203085 0.282304 -0.239562 -0.654399 0.231856 0.220653 0.231123 0.262903 0.340782 0.273463 0.238984 0.233653 0.259431 0.295614 0.295039
chargesum: 0.00000
title: Mulliken charges with hydrogens summed into heavy atoms:
elementType: Cl Cl O N C C C C C C C C C C
charge: -0.059925 -0.075291 -0.267063 -0.012515 -0.091786 0.118398 0.496165 -0.118937 -0.171176 -0.086865 0.030568 0.282304 0.019869 -0.063747
polarizability: 1.49662480e+02 -1.58910588e+01 1.53303150e+02 -2.72673879e+01 -8.91463330e+00 9.16168625e+01
1716.lowfreq: -11.0806 -7.3912 -4.3737 -0.0025 -0.0022 -0.0020 8.1309 15.8545 26.5200
frequency: 4.6163 15.7030 26.4395 64.8361 94.1646 100.8369 177.5316 191.7156 219.3454 230.6191 308.1481 367.6579 377.8017 394.2511 417.7791 448.1902 502.9059 558.6432 591.8466 604.0830 664.3043 669.4715 674.5874 698.0237 785.9679 794.8994 836.6683 892.0942 906.2089 907.5096 916.6979 978.3058 982.6444 988.7545 1032.9778 1072.0596 1093.7083 1096.9365 1149.1986 1176.7965 1186.2193 1211.2233 1233.4042 1255.1188 1268.4939 1293.1046 1317.2708 1358.9924 1377.1967 1417.5615 1420.7602 1459.7287 1466.3811 1467.1068 1513.4475 1575.6904 1605.7046 1611.7331 2998.3035 3000.0336 3063.2153 3070.7616 3079.8616 3125.9895 3150.2636 3152.9407 3155.4727 3175.6801 3499.0857
redmass: 7.7406 8.0622 8.7415 4.9838 3.3393 5.9117 5.4327 3.9227 4.7795 5.4177 3.2832 4.0610 8.0039 4.7312 2.9291 3.1379 4.6998 3.3517 3.7242 3.8637 2.9914 2.6383 2.0679 2.1666 1.5246 2.5673 3.0365 1.6315 1.7236 1.3843 2.3651 1.3535 4.5343 3.0179 1.9733 2.1475 2.5313 2.1463 1.1157 1.0987 1.2236 2.3372 1.4461 1.1890 1.7315 1.3031 1.3066 1.3319 7.4101 1.0903 2.5369 1.3132 1.1999 1.5976 1.9700 6.4007 6.9729 7.9376 1.0620 1.0626 1.1004 1.0568 1.1017 1.0881 1.0929 1.1091 1.0929 1.0976 1.0775
irintensity: 0.8576 0.0273 0.1289 10.3967 8.0608 0.4189 2.7445 8.3164 1.4202 3.3744 10.7731 2.9459 6.8759 3.1812 9.4124 4.5037 0.7514 6.3410 3.0449 3.1064 55.5629 67.4039 88.2953 24.4762 32.1631 25.4893 22.6425 11.9392 7.2684 0.0348 0.9403 0.5219 12.1397 4.9120 14.5104 21.2137 10.4555 7.4266 1.3194 1.5793 5.5004 9.7152 1.5276 19.5793 59.7864 0.6027 18.0036 13.6590 1.8546 29.5600 23.9082 5.5066 22.7800 37.5435 221.8106 46.0830 110.6307 175.7692 24.0797 28.6588 19.2361 4.0657 7.3605 7.3495 15.3765 1.0161 1.8962 5.9107 40.2236
temp: 298.150 k
press: 1.00000 atm
elementType: 17 17 8 7 6 6 6 6 6 6 6 6 6 6 1 1 1 1 1 1 1 1 1 1 1
symmnumber: 1
zpe: 499594.5 jmol-1
zpe.correction: 0.190285 hartree
zpe.thermalcorrener: 0.204389 hartree
zpe.thermalcorrenthalpy: 0.205333 hartree
zpe.thermalcorrgfe: 0.143729 hartree
zpe.sumelectzpe: -1436.742241 hartree
zpe.sumelectthermal: -1436.728138 hartree
zpe.sumelectthermalent: -1436.727193 hartree
zpe.sumelectthermalfe: -1436.788798 hartree
dipole: -1.5275 -2.1502 1.5423
dipole: 3.0553
quadrupole: -103.4984 -95.2996 -95.9876
quadrupole: 10.6134 -1.7384 -4.4929
quadrupole: -5.2365 2.9622 2.2743 10.6134 -1.7384 -4.4929
hfenergy: -1436.9325267 hartree
pointgroup: C01 [X(C10H11Cl2N1O1)]
dipole: -0.7995365 -0.819462 0.3662775 debye
dipolederiv: -0.1289165 0.0207364 0.0199263 0.0914106 -0.7892856 0.1370996 0.0082654 0.1321289 -0.1096158 -0.3097879 0.2014373 0.1148452 0.0311191 -0.4938975 -0.1757316 0.0260827 -0.1825585 -0.2520759 -0.9968386 -0.0350344 0.0463068 0.3436545 -0.6915839 -0.2203946 0.2989511 -0.1522882 -0.470488 -1.2635735 -0.1607589 -0.0654613 -0.3657763 -0.5038499 -0.0314337 -0.1050725 -0.0105859 -0.4722034 -0.0419886 0.0252161 -0.0433033 0.0142809 0.0549546 0.0229447 -0.1646327 0.0651058 0.0711231 0.2563492 0.1018436 0.0924964 0.4191791 0.3380153 0.018046 0.3201368 -0.0292293 0.3040532 0.2674801 -0.0855121 -0.0799473 -0.1984421 0.137918 -0.0023672 -0.1323857 -0.0220926 -0.0701691 -0.1137783 0.0807206 -0.0230908 0.1618619 -0.3658367 0.0101302 -0.0401191 0.0103212 -0.0960758 -0.232003 0.0629227 -0.0220977 0.0240161 0.0208663 -0.0271562 0.0140636 -0.0603131 -0.1564316 0.1371583 -0.0190121 -0.083399 -0.1449778 1.1821637 -0.2330162 -0.0597068 -0.2207615 0.0416512 0.0860906 -0.0292495 -0.0878354 0.0183768 0.1020823 -0.0581557 -0.1084999 -0.0232819 -0.0729121 1.7356651 0.3353576 -0.0551232 -0.0542236 0.6909619 0.2649324 -0.4019348 0.1850465 0.3050312 -0.0785336 -0.0755581 -0.0283001 -0.0290611 -0.3250256 0.0808656 -0.0221672 0.0766932 -0.1302232 0.2381045 -0.454764 -0.225933 -0.2553963 0.332281 0.1290556 -0.1168022 0.1392174 0.2506626 0.0027147 0.0132481 0.0719006 -0.0189655 0.0324573 0.107049 0.0696014 0.0379031 -0.0366847 -0.0200587 -0.071663 -0.0374005 -0.0211108 -0.1191557 -0.0825918 -0.0189768 -0.0496605 0.0654948 0.0093329 -0.1244693 0.0574189 -0.1209266 0.0142354 0.03153 0.0201044 0.0647557 -0.0733101 -0.001578 0.1407063 0.0230047 0.0157957 0.0506977 -0.0161565 -0.0422132 -0.0292254 0.0798542 0.2566474 0.0104508 0.0578569 0.0116855 0.2134647 -0.0231959 0.1366581 -0.0132215 0.3019767 0.0236544 -0.0384264 0.0740659 -0.0485452 0.0771797 0.0196435 0.0937116 0.0230144 0.1069201 0.1144337 0.0336984 0.0240398 0.0158722 -0.1038098 0.0380028 0.0248534 0.0260749 0.1285267 -0.0266435 -0.0553702 0.0928751 -0.0599068 0.0354783 0.0510279 0.1027989 0.0472006 0.1006434 0.0267635 0.0634378 0.0561085 0.0780953 0.0524608 -0.0158399 0.0586263 -0.0115871 0.1442633 0.0044794 0.0431187 -0.0472391 0.0709464 0.0460562 -0.0128813 -0.0477863 -0.0428454 0.0210298 0.0548263 0.0169236 0.0682856 0.0210382 0.0111716 -0.0114068 0.0864434 0.0401893 0.0189594 unknown
polarizability: 154.1446096|-11.4710647|157.9823011|-18.1597926|1.5425823|82.455582 unknown
InChI: InChI=1S/C10H11Cl2NO/c11-7-10(14)13-5-4-8-2-1-3-9(12)6-8/h1-3,6,13H,4-5,7H2
charge 0 multiplicity 1
25 atoms
Cl -2.347141 3.025869 -0.66693
Cl 2.183029 2.138205 1.672746
O  3.801022 -1.164455 -0.08643
N  1.643298 -0.68086 0.68506
C  0.022756 -1.753238 -0.920092
C  1.041677 -1.946015 0.240903
C  -1.185518 -0.921525 -0.514939
C  -1.212825 0.477053 -0.757191
C  -2.288407 -1.522305 0.147725
C  -2.326624 1.229634 -0.337581
C  -3.394275 -0.74706 0.559901
C  2.965212 -0.386891 0.473884
C  -3.425652 0.646972 0.320507
C  3.494486 0.963733 0.961491
H  0.550453 -1.289356 -1.772923
H  -0.303151 -2.760341 -1.24318
H  0.540297 -2.432387 1.09922
H  1.870879 -2.593493 -0.092641
H  1.053062 0.029574 1.129533
H  -0.383262 0.966634 -1.27709
H  -2.284034 -2.603451 0.331351
H  -4.242097 -1.222548 1.064616
H  -4.278588 1.256803 0.631214
H  4.228133 0.806815 1.765985
H  3.96177 1.499736 0.123262
