program: Gaussian 09
title: 000214767
version: EM64L-G09RevD.01
frameworkgroup: C1[X(C18H19Cl3O)]
method: RPBEPBE
basis: SDD
operation: Freq
keyword: #p
keyword: freq=noraman
keyword: PBEPBE/SDD
title: #p freq=noraman PBEPBE/SDD
converged: YES YES NO NO
title: Mulliken charges:
elementType: Cl Cl Cl O C C C C C C C C C C C C C C C C C C H H H H H H H H H H H H H H H H H H H
charge: 0.085238 0.091465 0.108362 -0.265666 -0.328417 0.517590 0.530957 -0.657198 -0.405499 -0.377143 -0.419938 -0.358598 0.339151 -0.383158 -0.378417 0.445842 -0.414659 -0.372916 -0.255467 -0.807511 -0.394294 -0.678090 0.272032 0.228760 0.252484 0.236824 0.252569 0.250838 0.246439 0.230892 0.228763 0.201100 0.203016 0.228938 0.224730 0.234342 0.218845 0.219319 0.209884 0.228067 0.210522
chargesum: 0.00000
title: Mulliken charges with hydrogens summed into heavy atoms:
elementType: Cl Cl Cl O C C C C C C C C C C C C C C C C C C
charge: 0.085238 0.091465 0.108362 -0.265666 -0.056385 0.517590 0.530957 -0.657198 -0.176739 -0.124658 -0.183114 -0.106028 0.339151 -0.132320 -0.131977 0.445842 -0.183768 -0.144153 0.148648 -0.119500 0.043870 -0.029616
polarizability: 3.06244588e+02 2.05077925e+01 2.05581713e+02 -1.55418243e+01 1.02221029e+01 1.90301228e+02
1716.lowfreq: -2.2697 -0.0023 0.0019 0.0021 2.2393 9.2647 19.7471 23.5654 28.2205
frequency: 19.7082 23.4590 28.1758 39.7256 50.9036 55.4651 66.9143 70.0255 85.0616 119.4587 139.1219 147.6323 171.4576 180.6831 189.7633 194.1802 221.7675 225.6647 266.4699 275.4065 295.3612 305.8221 335.2202 352.1579 361.9526 371.0395 407.0857 412.8379 470.3175 499.2808 502.7521 544.6945 581.9932 590.5463 635.0798 643.7311 683.7474 692.2967 718.1214 742.6016 768.3368 783.6121 793.8562 812.9139 821.9437 830.9860 841.3374 847.3672 877.4832 896.7811 902.4024 949.7164 953.2380 967.5806 972.1979 981.3294 989.0014 1001.9908 1013.5708 1014.6212 1047.5009 1053.9596 1122.9341 1127.2323 1136.3260 1141.8952 1181.5932 1185.0935 1197.8702 1206.2312 1225.1418 1230.4876 1233.0433 1249.0017 1287.1486 1297.7320 1310.9863 1320.5766 1323.3933 1376.3231 1379.1811 1389.5638 1395.6964 1398.9761 1408.0513 1422.4650 1470.5232 1472.7317 1475.6206 1479.7380 1480.2976 1489.5573 1501.7837 1505.6377 1581.4678 1584.2336 1621.7195 1623.4359 2945.9413 2976.7885 2978.4361 2998.6887 3003.9383 3004.6870 3052.5025 3055.8788 3080.8994 3083.9071 3086.5270 3119.6733 3121.1197 3123.3951 3143.2592 3148.2307 3159.8871 3165.5365 3169.5352
redmass: 4.3878 1.0426 3.6613 5.5139 5.5593 5.5946 4.6893 4.5631 1.8159 5.9824 2.7521 4.7478 5.5464 10.1848 12.1419 7.7036 3.0990 1.3062 13.8063 17.3726 4.6410 4.0877 5.9025 4.2321 4.0189 7.1337 2.8322 2.9858 3.9392 4.0350 3.1267 3.8672 4.3990 6.5143 7.0445 7.0532 5.7943 8.8419 3.5026 3.3897 1.0847 3.5292 5.9668 2.3504 1.3162 1.9255 2.0501 1.3868 3.9243 1.1545 1.7098 1.3841 1.3590 1.3528 1.3847 6.6380 1.4163 3.3691 3.1777 4.0825 1.5642 2.7796 1.3834 1.3628 2.1233 1.4490 3.1544 1.3609 1.1483 1.9625 2.9847 1.2832 2.6043 1.6705 1.1035 1.3471 1.3571 1.3049 1.4383 2.2143 2.5408 2.1401 1.3544 1.2564 2.7198 3.2280 1.0583 1.0820 1.0906 1.0785 1.0611 1.1538 2.0622 2.5652 6.9074 6.0389 6.3185 6.3796 1.0551 1.0380 1.0362 1.0822 1.1049 1.0614 1.1014 1.0965 1.1030 1.0988 1.0991 1.0875 1.0889 1.0895 1.0965 1.0873 1.0946 1.0948 1.0958
irintensity: 0.4454 0.3861 0.3022 0.0468 0.3873 0.0447 0.2125 0.3837 0.0145 0.1824 2.6049 1.1009 2.0537 1.2388 0.5136 0.2689 0.4714 0.0230 0.5603 1.0316 2.2581 0.4744 2.2684 0.5559 1.1130 2.0220 0.2888 0.5776 0.2092 1.1829 7.3178 47.3655 75.1797 52.0193 2.2744 11.9230 81.0955 93.2127 4.5939 42.6504 10.0418 3.5646 34.0601 15.4943 2.4411 24.5984 36.0469 8.4778 13.2546 3.4588 7.9603 2.1568 0.7281 0.4497 0.5340 97.3686 1.7731 6.0861 12.2730 35.4206 15.0290 6.3453 4.8121 22.2628 6.4972 0.3856 2.3676 160.7528 2.4043 1.2417 0.3894 7.2852 214.1994 1.5908 0.0018 1.5727 0.9668 3.4026 2.4405 3.6433 3.3432 7.5108 39.9703 11.1717 2.7806 0.9769 13.1198 23.5239 14.5497 12.2235 12.5661 70.9612 100.1220 21.7359 20.9456 0.2927 31.2601 50.2593 33.2274 38.0985 38.3670 5.0556 26.6957 23.9740 0.0561 20.8973 80.5216 44.4475 18.5668 9.2418 25.0655 11.0118 21.5393 8.0033 3.7434 9.2595 6.1545
temp: 298.150 k
press: 1.00000 atm
elementType: 17 17 17 8 6 6 6 6 6 6 6 6 6 6 6 6 6 6 6 6 6 6 1 1 1 1 1 1 1 1 1 1 1 1 1 1 1 1 1 1 1
symmnumber: 1
zpe: 837935.8 jmol-1
zpe.correction: 0.319153 hartree
zpe.thermalcorrener: 0.342210 hartree
zpe.thermalcorrenthalpy: 0.343154 hartree
zpe.thermalcorrgfe: 0.262966 hartree
zpe.sumelectzpe: -2151.090222 hartree
zpe.sumelectthermal: -2151.067165 hartree
zpe.sumelectthermalent: -2151.066221 hartree
zpe.sumelectthermalfe: -2151.146409 hartree
dipole: -1.8666 2.7409 0.5042
dipole: 3.3543
quadrupole: -132.9515 -153.0065 -144.5708
quadrupole: 9.0596 -11.4165 3.6858
quadrupole: 10.5581 -9.4969 -1.0611 9.0596 -11.4165 3.6858
hfenergy: -2151.4093752 hartree
pointgroup: C01 [X(C18H19Cl3O1)]
dipole: -0.6223805 1.1528801 0.1581844 debye
polarizability: 308.3757806|9.9698332|203.692725|-18.1431765|10.7572939|190.0590241 unknown
InChI: InChI=1S/C18H19Cl3O/c1-3-12-22-16-10-8-15(9-11-16)17(18(19,20)21)14-6-4-13(2)5-7-14/h4-11,17H,3,12H2,1-2H3
charge 0 multiplicity 1
41 atoms
Cl 1.817111 -2.030587 2.149995
Cl 3.377396 -2.95527 -0.249047
Cl 0.467432 -3.688464 0.000825
O  -4.184652 0.715579 -0.642713
C  1.321078 -1.044406 -0.516965
C  -0.155748 -0.626607 -0.442697
C  2.286161 0.132277 -0.279959
C  1.699194 -2.312056 0.303693
C  -0.76262 -0.194758 -1.653652
C  -0.9355 -0.592286 0.73694
C  3.392554 0.314304 -1.144732
C  2.085422 1.07139 0.76283
C  -2.863922 0.269387 -0.501198
C  -2.094008 0.250695 -1.690945
C  -2.279279 -0.155196 0.717207
C  4.092065 2.332364 0.079947
C  4.281676 1.396815 -0.967107
C  2.977767 2.147549 0.940621
C  -5.045321 0.722426 0.555831
C  5.032766 3.50985 0.267107
C  -6.425686 1.214004 0.114254
C  -7.417168 1.267597 1.29728
H  1.487852 -1.385646 -1.558426
H  -0.180935 -0.207313 -2.583582
H  -0.512455 -0.930912 1.687128
H  3.567564 -0.399153 -1.958463
H  1.223565 0.969094 1.429155
H  -2.560213 0.578636 -2.624819
H  -2.852411 -0.156568 1.648925
H  5.13232 1.515514 -1.648926
H  2.806072 2.860339 1.756732
H  -4.610256 1.39654 1.323604
H  -5.104864 -0.303311 0.976913
H  5.330769 3.623736 1.32541
H  5.950665 3.39432 -0.334387
H  4.550605 4.458462 -0.03856
H  -6.318074 2.215888 -0.341422
H  -6.80721 0.541003 -0.675902
H  -7.06453 1.955586 2.088578
H  -8.407142 1.622703 0.96111
H  -7.55594 0.269274 1.753515
