program: Gaussian 09
title: 000214749
version: EM64L-G09RevD.01
frameworkgroup: C1[X(C15H15N3O)]
method: RPBEPBE
basis: SDD
operation: Freq
keyword: #p
keyword: freq=noraman
keyword: PBEPBE/SDD
title: #p freq=noraman PBEPBE/SDD
converged: YES YES NO NO
title: Mulliken charges:
elementType: O N N N C C C C C C C C C C C C C C C H H H H H H H H H H H H H H H
charge: -0.311912 -0.404350 -0.021613 -0.646582 -0.427982 0.291363 -0.557870 0.477168 0.291173 -0.527315 -0.045391 -0.392139 -0.377049 -0.342372 -0.257890 -0.248509 -0.183647 -0.370422 0.267605 0.267306 0.249306 0.222310 0.197214 0.243323 0.244017 0.294761 0.234166 0.261364 0.231785 0.230483 0.229094 0.238505 0.302819 0.341281
chargesum: 0.00000
title: Mulliken charges with hydrogens summed into heavy atoms:
elementType: O N N N C C C C C C C C C C C C C C C
charge: -0.311912 -0.109589 -0.021613 -0.002483 -0.160677 0.291363 -0.086254 0.477168 0.291173 -0.086777 -0.045391 -0.148122 -0.142884 -0.081007 -0.026104 -0.018026 0.045447 -0.131916 0.267605
polarizability: 2.13718365e+02 6.39103979e+00 1.74404811e+02 9.73146832e+00 -2.04695901e+01 1.43220090e+02
1716.lowfreq: -8.7129 -0.0008 -0.0006 -0.0004 5.0554 14.7697 27.1767 39.1789 61.6515
frequency: 26.8574 39.0799 61.6499 70.8415 93.0510 138.2212 165.6722 193.1440 233.7473 251.6891 274.7534 290.5316 307.5681 329.0225 353.6085 432.2182 445.7115 454.6892 466.8756 487.1593 503.9003 539.9417 546.5081 572.9034 589.2013 605.8000 638.6051 657.9417 714.9922 719.0772 731.4776 749.6782 769.1013 784.5923 813.3726 854.5727 867.6931 877.9577 918.2665 936.3532 947.3312 962.7160 972.2636 982.1159 990.2950 1031.0856 1038.0250 1045.7499 1060.2791 1089.7712 1099.4049 1107.2658 1157.7488 1168.2951 1181.8350 1197.4285 1210.4040 1224.8755 1232.6572 1247.0750 1267.4833 1289.9033 1320.0945 1325.8033 1335.6279 1361.0646 1368.4051 1389.0241 1427.6808 1434.4045 1453.1335 1456.6266 1459.5244 1473.9761 1489.7935 1571.3460 1581.6252 1584.7706 1596.5816 1610.6788 1640.6409 2966.8993 2988.5995 3013.9046 3023.0287 3073.9526 3113.0831 3120.7667 3126.7985 3139.5105 3140.4960 3161.6617 3166.4482 3543.2055 3560.6877 3701.3056
redmass: 4.8643 6.3264 4.4899 4.6093 4.1605 4.2615 3.0006 4.6234 2.8809 1.3969 4.2095 3.2819 4.8870 4.9623 3.1426 2.5524 2.5694 1.5199 2.6773 3.9634 1.1809 4.2682 3.5474 3.8072 2.8845 5.9879 5.9400 6.0728 6.1481 5.4356 2.6748 3.4506 1.6106 1.8796 2.1163 4.0033 2.2866 1.6321 3.0083 1.4557 1.7491 2.2793 2.0014 1.4743 1.3352 2.9941 2.5872 2.4452 2.4313 3.2008 2.0634 2.1296 1.1722 1.6387 1.3152 2.0429 1.7332 1.4365 1.6510 1.7705 1.4926 1.4823 3.4387 1.7411 1.7512 1.5760 2.2552 2.3827 2.0518 2.3393 1.2631 1.3588 1.9794 1.7136 2.1985 5.8293 6.1716 6.3787 1.4957 6.0279 2.8394 1.0628 1.0648 1.0830 1.0971 1.0963 1.0870 1.0888 1.0883 1.0928 1.0915 1.1008 1.0998 1.0473 1.0760 1.1041
irintensity: 2.9497 1.7803 15.5359 4.4304 4.1642 2.3925 0.7358 9.1176 2.7779 3.4770 0.5948 3.6094 0.9126 4.9737 3.0280 21.3070 63.6457 278.1428 66.9899 4.4900 1.2285 1.6032 6.4035 20.0746 9.2629 6.0193 8.4831 0.0976 10.2283 11.4803 9.9181 18.7301 36.3624 49.4511 14.4806 11.5778 12.9843 7.7236 2.3521 1.6723 1.6822 7.2486 2.2302 0.2116 0.0815 2.9864 2.4643 6.7978 0.7127 32.4351 13.9648 5.4044 3.0895 5.0353 2.3646 0.7733 11.2280 1.6874 6.1606 4.8775 8.5674 13.2194 13.2297 10.5309 98.9026 3.9509 13.2171 1.2707 3.8973 9.8780 27.7065 78.3466 134.8334 359.9056 33.2063 9.3214 13.7547 2.3427 99.1094 1.4058 262.1533 19.1343 27.4139 10.4039 36.5207 15.8335 11.0740 2.1736 12.8073 23.1132 15.1529 32.8583 26.5415 44.2243 9.4363 37.3586
temp: 298.150 k
press: 1.00000 atm
elementType: 8 7 7 7 6 6 6 6 6 6 6 6 6 6 6 6 6 6 6 1 1 1 1 1 1 1 1 1 1 1 1 1 1 1
symmnumber: 1
zpe: 716163.5 jmol-1
zpe.correction: 0.272772 hartree
zpe.thermalcorrener: 0.288864 hartree
zpe.thermalcorrenthalpy: 0.289808 hartree
zpe.thermalcorrgfe: 0.228388 hartree
zpe.sumelectzpe: -818.753197 hartree
zpe.sumelectthermal: -818.737105 hartree
zpe.sumelectthermalent: -818.736161 hartree
zpe.sumelectthermalfe: -818.797581 hartree
dipole: 2.4337 0.8459 2.4835
dipole: 3.5786
quadrupole: -106.1093 -110.2608 -102.2241
quadrupole: -1.0308 2.3983 11.1880
quadrupole: 0.0888 -4.0628 3.9740 -1.0308 2.3983 11.1880
hfenergy: -819.025969 hartree
pointgroup: C01 [X(C15H15N3O1)]
dipole: -0.9513607 -0.3660762 0.9711854 debye
polarizability: 213.6788405|6.5272905|172.1728081|-9.9099442|21.9330268|145.4916174 unknown
InChI: InChI=1S/C15H15N3O/c16-15(19)18-14-11-5-2-1-4-10(11)7-8-13-12(14)6-3-9-17-13/h1-6,9,14,18H,7-8,16H2
charge 0 multiplicity 1
34 atoms
O  1.44639 -3.056658 -0.797049
N  0.196399 -1.708852 0.648415
N  2.444381 2.144877 0.673823
N  1.050975 -3.779066 1.386863
C  0.007784 -0.655928 -0.385316
C  -1.42752 -0.106771 -0.305057
C  -0.985195 1.961405 1.277039
C  1.16811 0.342336 -0.390498
C  -1.868441 1.022676 0.450116
C  0.37737 1.430304 1.78084
C  1.376443 1.28835 0.651674
C  -2.387919 -0.852634 -1.046285
C  -3.254271 1.349911 0.419234
C  2.119591 0.2881 -1.43495
C  -3.753207 -0.512689 -1.065907
C  -4.191611 0.607285 -0.32287
C  3.223985 1.168728 -1.424383
C  3.344429 2.077378 -0.351556
C  0.929562 -2.857147 0.347316
H  0.086624 -1.20299 -1.343265
H  -0.790922 2.877563 0.681978
H  -1.576157 2.291797 2.153097
H  0.23792 0.46626 2.308319
H  0.799999 2.147872 2.504417
H  -2.042254 -1.722843 -1.617781
H  -0.312963 -1.620373 1.527658
H  -3.596376 2.217495 0.997845
H  2.005137 -0.454949 -2.231603
H  -4.461647 -1.107203 -1.65264
H  -5.248675 0.895493 -0.320651
H  3.975986 1.146157 -2.219114
H  4.185518 2.778297 -0.294788
H  0.714363 -3.612837 2.332477
H  1.575594 -4.626645 1.187805
