program: Gaussian 09
title: 000214714
version: EM64L-G09RevD.01
frameworkgroup: C1[X(C4H6N2OS)]
method: RPBEPBE
basis: SDD
operation: Freq
keyword: #p
keyword: freq=noraman
keyword: PBEPBE/SDD
title: #p freq=noraman PBEPBE/SDD
converged: NO NO NO NO
title: Mulliken charges:
elementType: S O N N C C C C H H H H H H
charge: 0.269467 -0.296122 -0.011474 -0.466444 0.299427 -0.273101 -0.672764 -0.471652 0.229128 0.229347 0.297517 0.270224 0.298185 0.298263
chargesum: 0.00000
title: Mulliken charges with hydrogens summed into heavy atoms:
elementType: S O N N C C C C
charge: 0.269467 -0.296122 -0.011474 0.130003 0.299427 0.185374 -0.375247 -0.201428
polarizability: 1.05441370e+02 -9.50845426e-01 7.51247348e+01 -6.23679128e-03 1.08654176e-03 3.93441456e+01
1716.lowfreq: -15.9299 -0.0015 -0.0013 -0.0009 6.9307 11.6114 39.6859 63.0950 128.2332
frequency: 38.8890 62.9718 128.2143 195.8990 223.9650 339.9417 384.7682 463.1652 566.3886 633.8747 636.5414 740.4548 764.9063 803.8309 814.2173 818.2874 926.8158 940.4050 1011.2959 1123.3745 1130.5108 1161.7180 1202.0925 1221.5630 1262.6793 1369.1635 1429.7618 1468.6619 1531.5762 1609.7372 2980.4504 3033.5028 3226.6760 3261.3454 3327.5188 3468.4298
redmass: 3.6522 3.0046 5.8895 1.1957 3.1769 6.8260 6.0016 4.1306 10.1452 6.5319 5.1050 1.2111 4.9267 1.2144 4.6136 4.2695 3.7118 3.7319 1.7279 1.3677 2.0637 1.0635 1.5081 1.1263 1.8937 1.8614 9.0957 1.1208 5.9591 1.0715 1.0564 1.1061 1.0959 1.0965 1.0411 1.0997
irintensity: 0.0051 0.1772 1.4379 74.4070 12.0421 6.6891 3.4792 2.9340 19.4775 7.6775 0.0007 1.6203 38.1412 94.0928 5.9557 36.9102 20.2028 42.6998 0.2434 4.0194 72.4482 0.6441 0.5533 0.4179 9.0963 3.1557 64.4210 14.5373 7.2611 15.7938 25.3974 28.6361 0.0663 4.5819 2.5143 0.0860
temp: 298.150 k
press: 1.00000 atm
elementType: 16 8 7 7 6 6 6 6 1 1 1 1 1 1
symmnumber: 1
zpe: 264994.3 jmol-1
zpe.correction: 0.100931 hartree
zpe.thermalcorrener: 0.109295 hartree
zpe.thermalcorrenthalpy: 0.110239 hartree
zpe.thermalcorrgfe: 0.066390 hartree
zpe.sumelectzpe: -738.114591 hartree
zpe.sumelectthermal: -738.106227 hartree
zpe.sumelectthermalent: -738.105283 hartree
zpe.sumelectthermalfe: -738.149132 hartree
dipole: -1.2099 -1.5001 0.0048
dipole: 1.9272
quadrupole: -41.7189 -55.9954 -54.2397
quadrupole: 6.5008 -0.0167 0.0048
quadrupole: 8.9324 -5.3441 -3.5883 6.5008 -0.0167 0.0048
hfenergy: -738.2155221 hartree
pointgroup: C01 [X(C4H6N2O1S1)]
dipole: -0.4718585 -0.3607978 -0.4712732 debye
dipolederiv: -0.2332472 0.0718144 0.1776965 0.0667074 0.0021718 -0.2388226 0.1702546 -0.239944 -0.2506227 -0.552603 -0.0815013 -0.0912522 -0.0276185 -0.3587922 -0.0012487 -0.0099724 0.0084271 -0.3409364 -0.5878972 0.2048031 0.3895467 0.0507256 -0.2321354 -0.1070705 0.1509793 -0.1337747 -0.401166 -0.0849694 0.0570992 0.0949043 0.0111201 -0.1041638 -0.0988691 0.0243796 -0.107043 -0.2099734 0.3666075 -0.0247856 -0.102503 -0.0421432 -0.0053198 0.0009195 -0.1296319 -0.0017229 0.0182846 0.4663376 0.0644847 0.0919907 0.2450995 0.43129 -0.0259619 0.3713816 0.005237 0.3645184 0.2318117 -0.0198679 -0.1257905 0.0553579 -0.2532604 0.0786293 -0.0093009 0.0919138 -0.1672372 0.1342085 -0.1932207 -0.3579325 -0.1268875 0.0495436 0.4200302 -0.2560423 0.4310603 0.5020833 -0.0110109 -0.0263819 0.0265669 -0.0589767 0.031481 0.0817347 -0.029313 0.0399001 -0.1143352 -0.0253343 0.0529284 0.0000285 0.0116332 -0.1270734 -0.0365871 -0.0580339 -0.0077921 0.0595861 0.0950963 -0.0287565 -0.0215876 -0.0313884 0.1796591 -0.0647409 -0.0256214 -0.0652151 0.1290675 0.0305378 -0.0212556 -0.0034061 -0.0399447 0.1464163 -0.0744782 -0.0318635 -0.0775264 0.0850619 0.0876018 -0.0412576 -0.0187573 -0.0517086 -0.0010931 0.0100024 -0.0689009 -0.0518408 0.281168 0.0828607 -0.0141027 -0.0595044 -0.0619763 0.2412764 0.056463 -0.0983148 0.1083205 0.0445012 unknown
polarizability: 104.8582013|4.7499151|50.259633|-4.0916426|16.02251|64.7924162 unknown
InChI: InChI=1S/C4H6N2OS/c5-7-1-4-2-8-3-6-4/h2-3H,1,5H2
charge 0 multiplicity 1
14 atoms
S  2.519609 -0.399946 -0.941374
O  -2.006452 -0.58668 -0.441202
N  1.140901 0.727626 1.038962
N  -3.449504 -0.512086 -0.075281
C  0.203939 0.082039 0.206598
C  -1.25236 0.160429 0.582084
C  0.734236 -0.57152 -0.893235
C  2.375241 0.577141 0.592801
H  -1.423793 -0.283225 1.582244
H  -1.59318 1.213615 0.614354
H  0.197413 -1.12748 -1.656871
H  3.265656 0.986414 1.068914
H  -3.743754 -1.500392 0.01548
H  -3.904052 -0.088337 -0.903076
