program: Gaussian 09
title: 000214724
version: EM64L-G09RevD.01
frameworkgroup: C1[X(C8H17N2O3PS)]
method: RPBEPBE
basis: SDD
operation: Freq
keyword: #p
keyword: freq=noraman
keyword: PBEPBE/SDD
title: #p freq=noraman PBEPBE/SDD
converged: YES YES NO NO
title: Mulliken charges:
elementType: S P O O O N N C C C C C C C C H H H H H H H H H H H H H H H H H
charge: 0.057739 1.033609 -0.250732 -0.456891 -0.596955 -0.189588 -0.740695 0.418609 -0.065087 -0.788515 -0.354599 -0.316491 -0.716611 -0.689584 -0.486013 0.233567 0.279972 0.341965 0.226513 0.209506 0.354317 0.190845 0.245786 0.223278 0.230175 0.226728 0.225162 0.213377 0.223475 0.226934 0.243704 0.246499
chargesum: 0.00000
title: Mulliken charges with hydrogens summed into heavy atoms:
elementType: S P O O O N N C C C C C C C C
charge: 0.057739 1.033609 -0.250732 -0.456891 -0.596955 -0.189588 -0.386378 0.418609 0.168480 -0.166578 0.081420 0.120141 -0.036430 -0.027571 0.231125
polarizability: 1.79355762e+02 5.44959993e+00 1.40425427e+02 1.00540828e+01 -2.56142396e+00 1.31384585e+02
1716.lowfreq: -15.5446 -13.6507 -6.4841 -0.0024 0.0014 0.0017 11.1559 47.4079 54.6452
frequency: -12.8912 47.4063 54.5370 64.5868 80.3488 94.7464 133.9529 139.2457 150.4442 185.6432 190.8107 216.7615 233.7566 248.9370 267.3270 280.3610 290.2480 330.1876 338.1574 368.7533 377.5970 391.6822 429.5082 468.4992 486.2224 536.8923 594.5968 622.1477 692.2869 695.5629 714.7793 782.8910 806.4017 829.3780 856.5751 915.5885 925.1452 930.4979 946.6694 952.8606 984.5697 1019.5285 1048.6989 1063.7403 1091.0918 1094.7304 1105.9009 1109.0561 1119.3791 1126.7619 1168.5360 1198.4865 1203.8801 1225.6213 1245.4052 1277.7515 1315.2258 1328.9511 1339.3336 1347.1720 1372.4477 1379.9188 1390.4282 1419.6467 1427.0132 1458.7301 1464.8351 1469.2096 1471.1201 1472.1062 1477.6169 1480.5345 1489.8788 2895.0009 2978.3164 2979.5213 2983.9897 2989.5655 3012.4356 3034.5916 3061.9175 3073.4891 3079.1563 3080.9153 3082.7548 3091.0050 3092.2264 3126.9398 3146.4367 3568.3918
redmass: 3.1359 4.2535 3.1949 4.7827 2.6652 1.0725 3.1183 3.1970 3.2503 5.8662 3.9917 2.2157 1.0624 7.6274 1.3617 3.7762 4.5104 7.8210 3.6263 2.7007 2.5283 12.8756 1.5901 5.6800 4.3840 3.2085 4.0731 9.2912 5.9622 3.9371 2.9406 1.4380 2.5665 2.4957 3.2064 3.0026 2.1957 1.7234 3.3343 9.2838 2.0759 4.9153 2.4054 2.0211 1.9288 2.8886 1.2689 1.8359 1.8655 1.3178 2.1747 1.5820 1.5264 2.4837 1.2364 1.5839 1.4106 1.3213 1.2998 1.5211 1.3167 1.2453 1.2316 1.1219 1.0845 1.0515 1.0568 1.0530 1.0644 1.0528 1.0507 1.0669 1.0703 1.0715 1.0304 1.0353 1.0363 1.0664 1.0831 1.0887 1.0565 1.0992 1.0989 1.1045 1.1001 1.1005 1.1020 1.1028 1.1095 1.0765
irintensity: 4.0995 0.8157 0.2074 0.7195 2.0115 0.1052 0.7567 0.1476 4.3531 6.1814 6.1575 5.4061 0.0628 17.1548 0.5202 0.9004 4.1957 7.2015 10.2519 0.9550 5.6848 33.2541 44.7353 52.6522 16.9537 15.3284 3.8986 153.2959 27.5021 7.2612 17.7093 17.8003 40.6253 13.6863 66.9351 55.8872 47.1166 20.4555 14.8561 232.5650 38.1801 80.6147 57.8513 14.5467 9.7882 138.2452 1.7662 26.2180 25.0652 2.3922 18.8514 44.4106 56.6278 63.4466 8.0195 24.8725 7.7330 22.5925 45.0832 134.0803 6.3301 28.9906 17.1569 0.3521 17.7309 15.2659 12.6914 13.6788 9.8967 9.9134 3.2233 1.5922 3.2789 58.2582 55.0511 21.4431 24.4470 40.3023 64.0352 3.2452 5.6462 30.9958 33.6495 31.4951 43.4089 30.3925 31.5403 12.4339 0.4037 41.7705
temp: 298.150 k
press: 1.00000 atm
elementType: 16 15 8 8 8 7 7 6 6 6 6 6 6 6 6 1 1 1 1 1 1 1 1 1 1 1 1 1 1 1 1 1
symmnumber: 1
zpe: 670721.9 jmol-1
zpe.correction: 0.255465 hartree
zpe.thermalcorrener: 0.272677 hartree
zpe.thermalcorrenthalpy: 0.273621 hartree
zpe.thermalcorrgfe: 0.210686 hartree
zpe.sumelectzpe: -1388.265279 hartree
zpe.sumelectthermal: -1388.248066 hartree
zpe.sumelectthermalent: -1388.247122 hartree
zpe.sumelectthermalfe: -1388.310057 hartree
dipole: 5.0276 2.5498 -0.8601
dipole: 5.7024
quadrupole: -100.4037 -108.4087 -106.2666
quadrupole: -9.2341 0.7830 -5.0288
quadrupole: 4.6226 -3.3824 -1.2402 -9.2341 0.7830 -5.0288
hfenergy: -1388.5207435 hartree
pointgroup: C01 [X(C8H17N2O3P1S1)]
dipole: -1.8434136 1.2749594 -0.098141 debye
polarizability: 175.1474073|-7.2341385|142.3060131|15.9220988|-1.7442999|133.7123533 unknown
InChI: InChI=1S/C8H17N2O3PS/c1-4-10-7(2)5-13-8(10,6-15)9-14(11)12-3/h7,9H,4-6H2,1-3H3
charge 0 multiplicity 1
32 atoms
S  1.213097 -1.865753 -1.117261
P  2.038541 -0.848855 0.755397
O  -0.483144 1.776854 -0.364113
O  3.1859 0.201923 -0.034898
O  2.595194 -1.599705 2.045837
N  -1.732933 -0.02738 0.42916
N  0.570667 0.041259 1.035667
C  -0.376292 0.326376 -0.028921
C  -2.71045 1.0152 0.0259
C  0.163418 -0.296373 -1.36784
C  -1.800299 2.258093 0.118652
C  -2.109398 -1.453474 0.461019
C  -3.352939 0.837187 -1.373171
C  -3.274199 -1.730487 1.429033
C  4.003302 1.090704 0.825964
H  -3.509621 1.069018 0.7890
H  -0.677367 -0.579093 -2.017614
H  0.799717 0.450947 -1.862873
H  -2.100607 3.083801 -0.546082
H  -1.714829 2.616414 1.162718
H  0.262442 0.243163 1.988211
H  -2.371373 -1.840797 -0.552059
H  -1.216593 -2.017693 0.7874
H  -4.132721 1.604784 -1.532942
H  -2.601505 0.942931 -2.176358
H  -3.835314 -0.15222 -1.472151
H  -3.022533 -1.385114 2.447333
H  -4.204296 -1.223852 1.111628
H  -3.48211 -2.814849 1.46873
H  3.373084 1.872519 1.289791
H  4.728299 1.551487 0.138731
H  4.529466 0.508682 1.603212
