program: Gaussian 09
title: 000214723
version: EM64L-G09RevD.01
frameworkgroup: C1[X(C6H15O2PS2)]
method: RPBEPBE
basis: SDD
operation: Freq
keyword: #p
keyword: freq=noraman
keyword: PBEPBE/SDD
title: #p freq=noraman PBEPBE/SDD
converged: NO YES NO NO
title: Mulliken charges:
elementType: S S P O O C C C C C C H H H H H H H H H H H H H H H
charge: -0.016618 0.217962 0.954719 -0.505001 -0.624298 -0.875535 -0.204060 -0.874045 -0.577935 -0.655429 -0.650130 0.275805 0.265829 0.286951 0.231230 0.218301 0.306549 0.348161 0.276518 0.246140 0.210250 0.231611 0.231959 0.228709 0.231475 0.220882
chargesum: 0.00000
title: Mulliken charges with hydrogens summed into heavy atoms:
elementType: S S P O O C C C C C C
charge: -0.016618 0.217962 0.954719 -0.505001 -0.624298 -0.046950 0.245471 -0.219336 -0.055277 0.018390 0.030936
polarizability: 1.77320533e+02 3.16325138e+00 1.31590534e+02 -1.34709736e+00 1.76264979e+00 1.04073420e+02
1716.lowfreq: -14.7197 -8.5133 -6.8038 -0.0007 0.0017 0.0026 13.2041 19.3906 38.7560
frequency: 11.8390 19.1277 38.6120 49.2919 61.2607 75.1929 113.9288 125.5086 156.5915 165.5674 194.3782 216.6030 231.6735 237.8876 247.8948 261.5899 290.5597 331.8160 354.1318 386.7648 419.9028 576.9410 619.5490 644.7233 670.3826 713.5986 785.7662 812.4519 837.4948 885.1066 931.3834 952.4388 997.0497 1023.4296 1029.3469 1037.1599 1067.7947 1107.7365 1135.9802 1177.2863 1236.8569 1256.7398 1258.4955 1285.9328 1341.2235 1356.1113 1395.6250 1395.8021 1403.2286 1430.2405 1432.4638 1458.8210 1459.5591 1470.9748 1477.5651 1483.2074 1487.7957 2979.9027 2986.0588 2995.6716 3002.9706 3010.9333 3024.2565 3047.9666 3075.1415 3080.7467 3092.3561 3101.8079 3109.1602 3129.1840 3146.8438 3153.7600
redmass: 3.7323 4.1927 3.0607 2.2993 3.0045 2.6026 4.1560 5.4277 1.0610 3.1740 3.5712 2.8924 2.5892 1.2670 1.7945 3.3090 5.8150 4.4467 3.8939 6.7927 7.5270 8.1907 4.1194 5.5259 7.6111 6.1288 1.1132 1.0880 1.4709 3.7800 1.7339 1.3267 1.7895 3.8011 2.8166 1.2149 2.1898 2.1917 1.4359 1.0630 1.2328 1.1315 1.1316 1.2072 1.1632 1.2602 1.2437 1.2043 1.0707 1.0454 1.0450 1.0401 1.0867 1.0393 1.0528 1.0480 1.0786 1.0572 1.0354 1.0367 1.0619 1.0589 1.0312 1.1063 1.1028 1.0988 1.0983 1.1047 1.1020 1.1036 1.1023 1.1024
irintensity: 0.3559 0.4284 0.3147 0.3708 2.5611 2.9606 9.1319 1.8903 0.1086 3.7036 0.2942 1.3696 5.7034 0.2362 2.9770 4.3828 4.8021 3.0046 1.3064 66.8252 75.8554 50.3946 7.2291 105.1903 29.5026 37.5155 10.6871 3.6549 9.1533 164.7112 8.4836 84.0665 11.1572 113.7119 80.0305 1.8653 2.6131 9.9888 5.9364 2.5096 0.6831 12.4567 15.3622 11.3887 22.8163 7.1913 34.0524 10.3521 11.6588 8.2160 10.8690 12.6349 9.8832 14.9363 6.3621 7.8010 10.3568 24.4461 36.2247 25.4198 9.0923 23.0899 0.8799 14.1649 4.2872 20.3761 26.9989 38.9904 33.9124 3.3077 1.3439 1.3556
temp: 298.150 k
press: 1.00000 atm
elementType: 16 16 15 8 8 6 6 6 6 6 6 1 1 1 1 1 1 1 1 1 1 1 1 1 1 1
symmnumber: 1
zpe: 541687.9 jmol-1
zpe.correction: 0.206318 hartree
zpe.thermalcorrener: 0.223203 hartree
zpe.thermalcorrenthalpy: 0.224147 hartree
zpe.thermalcorrgfe: 0.157950 hartree
zpe.sumelectzpe: -1524.506207 hartree
zpe.sumelectthermal: -1524.489322 hartree
zpe.sumelectthermalent: -1524.488378 hartree
zpe.sumelectthermalfe: -1524.554574 hartree
dipole: 1.7010 1.2735 -0.7642
dipole: 2.2581
quadrupole: -85.2619 -84.1085 -97.5938
quadrupole: -8.0121 -0.0237 -6.4253
quadrupole: 3.7262 4.8796 -8.6058 -8.0121 -0.0237 -6.4253
hfenergy: -1524.712525 hartree
pointgroup: C01 [X(C6H15O2P1S2)]
dipole: -0.7558587 -0.4457715 -0.1386624 debye
dipolederiv: -0.8851911 -0.0753309 0.0358662 -0.3935758 -0.3471033 0.0438767 0.0630475 0.0744561 -0.370833 -0.4792073 0.0449605 -0.1302136 0.1934869 -0.2018774 0.0061311 -0.1466482 -0.0122793 -0.1149263 2.1174459 -0.1951056 -0.2624556 0.2126376 1.3592323 -0.1208808 -0.4823519 -0.2292908 1.1883155 -1.3683918 0.4300255 0.1144124 0.5681758 -1.0390094 -0.0486717 0.0973277 -0.0132612 -0.4612006 -0.7482783 0.0499963 0.0198724 -0.0862323 -0.6008006 0.0255081 0.0828766 0.0866779 -0.7290686 -0.2966246 -0.0715485 0.0140623 -0.0239646 -0.3138551 -0.0362467 0.0758884 -0.0038287 -0.186277 0.4425519 -0.1401896 -0.0410909 -0.6895458 0.7419939 0.0597776 -0.1789032 0.0730788 0.3227267 1.0457083 0.0444347 0.1793455 0.0835332 0.0520315 0.0634548 0.4890488 0.1101793 -0.0201193 -0.0092831 -0.0369677 0.0528329 -0.0978028 0.342211 -0.0974049 0.1298562 -0.0728695 0.1404909 -0.1063225 0.0605985 -0.0372628 0.1478623 -0.0142604 -0.0021639 -0.0042718 -0.0099203 0.0524982 0.0244309 0.0075073 0.0115864 0.1472688 -0.0443071 0.0331882 -0.0687872 0.055037 0.0658034 0.1053884 -0.0155061 -0.0517093 -0.0001486 0.0801944 0.0024947 -0.054885 -0.0120011 -0.0159312 -0.0107807 0.0691876 -0.0032152 0.0897067 0.0566444 -0.00301 -0.0017705 -0.0010428 0.1093881 0.0581635 -0.0518455 0.0634232 -0.0988275 0.0324105 0.0471536 0.0536364 0.0141739 0.0588149 0.0268557 0.0100323 -0.0606726 0.0867904 -0.0138849 -0.018189 -0.0080667 -0.0806085 -0.1164471 -0.0229802 -0.1003995 0.0644298 0.0189239 -0.0585823 0.02064 0.0776751 0.060778 0.0068064 -0.0520306 0.0034362 -0.0388888 -0.0016631 -0.0588924 0.0143231 -0.0468798 0.0065591 0.1050301 -0.0274445 0.0384293 0.0191416 0.0115386 0.1006274 0.006661 -0.0924987 -0.0489603 0.0246678 0.0414149 0.0127099 0.09673 0.047154 -0.0252518 0.0169962 0.0711643 0.0220475 -0.0577789 -0.0303503 -0.1017836 -0.0702277 -0.0599332 -0.0749651 -0.0022481 -0.1009807 -0.010334 -0.0067802 0.0214728 0.0702348 0.0020694 0.1097205 -0.1352301 -0.0417364 -0.0013633 -0.0425639 0.1055854 0.0831661 0.0000388 -0.009523 -0.044507 0.1070308 -0.0552258 -0.0576622 -0.0339063 -0.1217402 0.0041775 -0.0575546 0.053795 -0.1318429 0.0350846 0.0821719 0.0740805 0.0820796 0.0252624 0.038915 0.035526 0.0568765 -0.0186673 0.1082371 -0.0076214 0.1239247 -0.0544136 -0.0987475 -0.0230018 -0.0350988 -0.0844002 -0.1241833 0.0430365 -0.0937762 -0.0824669 -0.0645439 0.0225421 0.0501958 0.0042129 0.0052159 0.0540955 -0.1307145 0.104798 -0.0109899 0.1047571 0.0719182 unknown
polarizability: 177.0498815|-4.9791097|128.5119823|-1.3983221|-9.0738246|107.4226237 unknown
InChI: InChI=1S/C3H8O2P.C3H7S2/c1-3-5-6(2)4;1-2-5-3-4/h3H2,1-2H3;2-3H2,1H3
charge 0 multiplicity 1
26 atoms
S  0.449553 0.978857 -1.560269
S  3.458965 1.224833 -0.555194
P  -0.814068 -0.021569 0.11384
O  -2.439801 0.540855 -0.136764
O  -0.165609 0.271928 1.552875
C  -1.059145 -1.795786 -0.36604
C  -2.743878 1.974098 0.133961
C  1.708667 1.833527 -0.398796
C  3.253578 -0.480574 0.254009
C  -4.205796 2.183241 -0.249919
C  4.623423 -1.167428 0.341271
H  -1.477392 -1.840968 -1.382402
H  -0.085744 -2.307559 -0.335469
H  -1.755439 -2.260737 0.34926
H  -2.564964 2.181948 1.205396
H  -2.064595 2.601388 -0.477152
H  1.712324 2.900059 -0.664413
H  1.335385 1.679877 0.630081
H  2.801241 -0.329435 1.248407
H  2.552146 -1.052981 -0.378839
H  -4.495201 3.23467 -0.067362
H  -4.365421 1.955571 -1.317374
H  -4.862924 1.531352 0.350323
H  5.076136 -1.291441 -0.658758
H  5.323449 -0.587548 0.9683
H  4.513411 -2.170878 0.792426
