program: Gaussian 09
title: 000214733
version: EM64L-G09RevD.01
frameworkgroup: C1[X(C15H19ClF2N2)]
method: RPBEPBE
basis: SDD
operation: Freq
keyword: #p
keyword: freq=noraman
keyword: PBEPBE/SDD
title: #p freq=noraman PBEPBE/SDD
converged: YES YES NO NO
title: Mulliken charges:
elementType: Cl F F N N C C C C C C C C C C C C C C C H H H H H H H H H H H H H H H H H H H
charge: -0.061985 -0.204564 -0.200344 -0.158966 -0.095211 -0.358994 -0.467818 -0.498244 0.152911 -0.393734 -0.348819 -0.336262 0.281853 -0.687668 -0.424822 -0.392255 0.539399 -0.192250 -0.373466 -0.082988 0.221923 0.227495 0.232586 0.236472 0.235031 0.268736 0.195228 0.242385 0.234242 0.190973 0.185378 0.200105 0.215743 0.215339 0.208685 0.259875 0.258372 0.255855 0.219803
chargesum: 0.00000
title: Mulliken charges with hydrogens summed into heavy atoms:
elementType: Cl F F N N C C C C C C C C C C C C C C C
charge: -0.061985 -0.204564 -0.200344 -0.158966 -0.095211 0.090424 0.001240 0.005523 0.152911 0.043879 0.076395 0.049222 0.281853 -0.047900 -0.164947 -0.133884 0.539399 0.063605 -0.373466 0.136815
polarizability: 2.96281548e+02 -2.18898308e+01 1.62209394e+02 5.27453617e+00 1.63384142e+01 1.45256140e+02
1716.lowfreq: -7.2467 -6.0095 -1.8141 -0.0019 -0.0007 0.0008 13.0612 17.8858 24.8657
frequency: 12.0174 17.8691 24.8372 46.5531 58.7310 70.6409 76.5405 106.6924 119.9793 128.7814 151.6641 166.0779 177.2222 195.7446 219.5414 229.5154 259.5626 293.7430 307.1211 339.0271 361.6891 370.6655 420.7901 463.7638 467.2625 481.1554 510.2412 529.2576 593.5155 604.0155 623.3231 635.7569 672.0202 694.6165 712.2504 746.2194 784.7668 812.6128 826.7644 854.3795 869.1161 874.9358 885.5765 912.5693 921.9509 939.5064 956.5363 958.9739 974.8230 984.0459 1015.8719 1026.8121 1038.9173 1063.5511 1072.9387 1114.8353 1126.5318 1129.5552 1156.9630 1165.6685 1193.0325 1196.2969 1218.2509 1231.5094 1240.1952 1266.2373 1281.4887 1283.0201 1287.6444 1288.8581 1302.6090 1314.2046 1323.4975 1330.1944 1344.1625 1363.3790 1367.2073 1391.6630 1410.6996 1422.0657 1448.2542 1455.9944 1462.1937 1472.4395 1473.7437 1476.8078 1477.3791 1486.1512 1501.8759 1573.8686 1596.2905 1635.9173 2957.1553 2962.0075 2974.4255 2975.8544 2988.4911 3004.5739 3008.7497 3018.6001 3034.6100 3043.1635 3057.0886 3072.0073 3074.2636 3079.6218 3096.9008 3098.8740 3155.0146 3162.2553 3175.8000
redmass: 5.3622 5.8367 6.8844 4.9636 5.0838 2.5534 2.0078 4.9258 3.2789 3.3036 5.3890 3.9963 3.4450 2.7806 6.4685 1.1734 2.5201 6.1675 3.7858 5.7946 7.1720 3.5249 5.7588 3.4153 4.5501 2.6875 7.5072 3.4680 2.7935 5.6050 4.9066 4.1147 5.6406 3.7240 3.0685 1.2080 3.9882 1.9556 1.4096 1.6983 1.6587 1.6689 1.5684 7.6268 1.7110 2.1031 2.1562 1.5923 5.1120 2.4189 2.4515 3.8035 2.6552 2.2204 1.7837 2.2070 1.5452 1.5662 1.3857 2.0068 1.6989 1.6858 1.2791 1.4047 1.7397 1.4752 1.3089 1.5276 1.3340 1.1342 1.4614 1.3114 1.8586 1.6010 1.4813 4.0785 1.4059 1.2123 4.0563 2.2091 1.2563 1.1693 1.0784 1.3531 1.0676 1.1161 1.4453 1.0746 1.2198 8.1253 6.4209 9.1628 1.0637 1.0612 1.0409 1.0581 1.0599 1.0653 1.0968 1.0724 1.0881 1.1010 1.1032 1.1006 1.0996 1.0975 1.1044 1.0894 1.0883 1.0909 1.0974
irintensity: 0.7678 0.9117 0.9311 0.5498 1.9631 0.6156 0.4499 1.2724 0.6663 0.1863 2.5325 0.4161 0.1740 4.8036 1.6134 0.4325 0.7801 3.3853 3.4908 1.1945 5.4917 4.0681 4.8899 11.2212 22.2410 5.0254 4.5248 6.3668 12.7148 4.3229 19.7041 13.1273 14.6112 0.5731 10.6328 7.3599 13.5254 2.7420 31.9922 6.2420 46.7699 2.1192 10.9224 125.6269 12.3042 10.7183 19.8543 4.3759 81.8446 0.7316 14.2230 42.9983 12.6721 12.4861 0.7442 3.3627 8.1706 15.6876 2.2908 73.7622 23.1838 20.6110 2.0808 0.6045 48.9301 112.2078 44.0373 2.6766 80.7235 5.3653 19.6357 0.9469 51.7022 17.3361 19.8542 103.4739 6.3144 10.0656 29.1586 65.6359 22.5417 6.1331 2.3607 21.9635 1.9928 8.6447 15.2069 14.2259 14.3658 43.3384 84.2653 1100.0103 54.6366 65.7954 19.8431 56.0823 53.7827 15.9013 10.7125 15.2251 51.3476 20.8344 31.2520 82.0905 56.6005 7.5955 32.6470 16.7373 3.2750 5.2655 5.1243
temp: 298.150 k
press: 1.00000 atm
elementType: 17 9 9 7 7 6 6 6 6 6 6 6 6 6 6 6 6 6 6 6 1 1 1 1 1 1 1 1 1 1 1 1 1 1 1 1 1 1 1
symmnumber: 1
zpe: 821913.4 jmol-1
zpe.correction: 0.313050 hartree
zpe.thermalcorrener: 0.333604 hartree
zpe.thermalcorrenthalpy: 0.334548 hartree
zpe.thermalcorrgfe: 0.259646 hartree
zpe.sumelectzpe: -1350.739831 hartree
zpe.sumelectthermal: -1350.719278 hartree
zpe.sumelectthermalent: -1350.718333 hartree
zpe.sumelectthermalfe: -1350.793236 hartree
dipole: -5.7502 0.4329 -1.9847
dipole: 6.0985
quadrupole: -119.0699 -124.0998 -126.2436
quadrupole: -9.8820 1.2428 -1.5853
quadrupole: 4.0679 -0.9620 -3.1059 -9.8820 1.2428 -1.5853
hfenergy: -1351.0528817 hartree
pointgroup: C01 [X(C15H19Cl1F2N2)]
dipole: -2.2338211 0.7955576 0.365958 debye
polarizability: 291.7165069|-7.4081505|145.8700414|-32.7246544|-15.8803013|166.1605335 unknown
InChI: InChI=1S/C15H19ClF2N2/c1-2-3-8-20-9-4-5-14(20)19-11-6-7-13(16)12(10-11)15(17)18/h6-7,10,15H,2-5,8-9H2,1H3
charge 0 multiplicity 1
39 atoms
Cl 5.248517 0.212206 -1.474158
F  2.753184 -2.690648 0.715826
F  3.799239 -1.046018 1.917802
N  -2.752109 0.934113 0.621776
N  -0.720462 0.88065 -0.561927
C  -3.298078 0.946524 1.996802
C  -2.055217 1.275091 2.866896
C  -0.866572 0.730583 2.030767
C  -1.372916 0.828947 0.582875
C  -3.577837 1.025672 -0.593533
C  -3.859795 -0.334298 -1.277566
C  -4.68558 -1.324275 -0.426179
C  0.666015 0.701891 -0.689161
C  -5.013438 -2.626062 -1.189443
C  1.416992 -0.290705 0.003751
C  1.35534 1.505317 -1.648774
C  2.804814 -0.458624 -0.215504
C  2.734778 1.351569 -1.87534
C  3.450921 0.375658 -1.154155
C  3.552608 -1.501609 0.563096
H  -3.736229 -0.037312 2.263708
H  -4.09552 1.706979 2.087491
H  -2.115996 0.82156 3.869577
H  -1.96106 2.368583 2.987952
H  -0.657703 -0.325493 2.286262
H  0.071417 1.292573 2.170306
H  -4.529931 1.519823 -0.318674
H  -3.035387 1.675198 -1.306067
H  -2.892125 -0.7907 -1.560318
H  -4.40101 -0.127182 -2.22402
H  -5.628363 -0.836229 -0.10164
H  -4.12561 -1.575643 0.496824
H  -4.087349 -3.140479 -1.507494
H  -5.593025 -3.328649 -0.562995
H  -5.607283 -2.414139 -2.098536
H  0.920321 -0.976486 0.696517
H  0.780576 2.248498 -2.209467
H  3.251586 1.979661 -2.606431
H  4.525184 -1.798843 0.140151
