program: Gaussian 09
title: 000012415
version: EM64L-G09RevD.01
frameworkgroup: C1[X(C5H11Br)]
method: RPBEPBE
basis: SDD
operation: Freq
keyword: #pfreq=noraman
keyword: PBEPBE/SDD
title: #p freq=noraman PBEPBE/SDD
converged: YES YES NO NO
title: Mulliken charges:
elementType: Br C C C C C H H H H H H H H H H H
charge: -0.062935 0.268406 -0.685176 -0.671645 -0.671443 -0.691684 0.275316 0.275219 0.238071 0.210276 0.207697 0.207564 0.237979 0.210305 0.214329 0.223594 0.214128
chargesum: 0.00000
title: Mulliken charges with hydrogens summed into heavy atoms:
elementType: Br C C C C C
charge: -0.062935 0.268406 -0.134641 -0.015602 -0.015595 -0.039633
polarizability: 8.91845505e+01 -7.70675359e+00 6.09842239e+01 3.09898438e-02 -7.24087240e-03 5.71199418e+01
1716.lowfreq: -12.4939 -5.5582 -0.0005 -0.0004 -0.0003 17.5447 87.4481 167.6612 178.6173
frequency: 87.3581 167.6515 178.5509 239.1751 245.3753 271.6022 322.2601 372.4711 400.3749 438.7027 625.0181 732.2246 851.0385 899.7274 930.7163 934.9581 948.5449 1014.2003 1020.5171 1106.2088 1185.3744 1247.8305 1262.3714 1278.8448 1375.2189 1380.1276 1402.0723 1436.3730 1455.9297 1463.3992 1465.5229 1482.0102 1482.1200 1496.2930 2972.0782 2976.5791 2981.0687 3038.9396 3067.6713 3071.5285 3072.8423 3079.0357 3085.6952 3090.4714 3125.7632
redmass: 2.2098 4.4003 1.1197 1.1881 1.0514 2.3031 2.1112 2.3499 2.0274 2.3575 4.7211 3.7808 1.5002 2.1958 1.5805 1.6120 1.2046 1.4305 1.3079 1.1818 1.8687 1.6015 2.4060 2.3590 1.1885 1.2076 1.1879 1.1084 1.0478 1.0485 1.0456 1.0562 1.0573 1.0641 1.0346 1.0354 1.0363 1.0563 1.1003 1.0999 1.0994 1.0986 1.0996 1.0988 1.1106
irintensity: 0.7737 1.4448 0.0270 0.1776 0.0806 1.3739 0.1091 0.1384 0.6558 2.1870 38.0489 3.9414 4.7381 28.4533 3.5563 1.5955 0.0009 0.6591 0.8523 4.4792 20.1477 12.1395 24.2694 3.8674 20.6347 27.6714 15.4554 2.4772 0.2041 0.9513 0.0415 18.3998 13.1223 26.9906 31.1030 43.3873 13.9533 19.1133 1.9892 47.9242 7.6041 78.0775 3.7470 46.5982 14.9515
temp: 298.150 k
press: 1.00000 atm
elementType: 35 6 6 6 6 6 1 1 1 1 1 1 1 1 1 1 1
symmnumber: 1
zpe: 387361.8 jmol-1
zpe.correction: 0.147538 hartree
zpe.thermalcorrener: 0.155822 hartree
zpe.thermalcorrenthalpy: 0.156766 hartree
zpe.thermalcorrgfe: 0.114391 hartree
zpe.sumelectzpe: -210.081510 hartree
zpe.sumelectthermal: -210.073226 hartree
zpe.sumelectthermalent: -210.072282 hartree
zpe.sumelectthermalfe: -210.114657 hartree
dipole: -2.6238 0.6968 -0.0022
dipole: 2.7148
quadrupole: -49.9398 -47.2475 -48.7082
quadrupole: -0.8360 0.0026 -0.0043
quadrupole: -1.3079 1.3844 -0.0764 -0.8360 0.0026 -0.0043
hfenergy: -210.2290483 hartree
pointgroup: C01 [X(C5H11Br1)]
dipole: -1.0254063 -0.2975321 0.0285527 debye
dipolederiv: -0.6063747 -0.0857256 0.0112222 -0.1698524 -0.2073209 0.0047465 0.0136811 0.0031745 -0.1588163 -0.0520631 -0.0227744 0.0041648 -0.2563669 0.0618421 0.0064963 0.0114489 0.0021588 0.1204577 0.8812305 0.2176144 -0.0223897 0.3019637 0.1619542 -0.0087066 -0.025039 -0.0071586 0.0627426 0.0064862 0.0014854 0.005529 -0.0084766 -0.0104269 -0.0595248 -0.0202675 -0.071005 -0.0213762 0.0061739 0.0038251 -0.0073213 -0.0045017 -0.0020505 0.058792 0.0197039 0.069929 -0.0300316 -0.1262745 -0.0675116 0.0057845 0.1600118 0.0319209 -0.0021695 -0.0019834 0.0023898 0.0646157 -0.0521037 -0.0640863 0.027941 -0.0378977 -0.0083287 0.0933398 -0.0238158 0.1159806 -0.0340547 -0.0520118 -0.0700564 -0.0229859 -0.0398439 -0.0210559 -0.0927298 0.0270973 -0.1142498 -0.0212649 -0.0160955 -0.139477 -0.0217366 -0.1074764 -0.0014407 -0.0224062 0.0160016 0.0059947 0.0834058 -0.1105113 0.1398919 0.0231645 0.117743 0.017583 -0.0240562 -0.0187133 0.0034145 0.0771443 0.0986071 0.007404 -0.0120958 0.0004488 -0.0054759 0.1436396 -0.0104238 0.0798955 -0.1225463 0.0990167 0.003958 0.0017471 -0.0060124 -0.0200731 -0.1501618 0.0006545 -0.0867186 -0.1085945 -0.016063 -0.1375988 0.0353334 -0.1071056 0.0013286 0.0321348 -0.0047355 0.0051393 0.0809888 -0.1093891 0.1386364 -0.0237962 0.1203712 0.0176513 0.0228405 0.0192281 -0.0058247 0.0761395 0.0981683 0.005658 -0.0282105 -0.0293647 -0.0029905 0.1126075 0.0180039 0.143144 -0.0946133 -0.1477342 0.0663688 0.0021436 0.1009412 0.0077762 0.0015613 0.0012037 0.0021378 0.102902 0.0989381 0.0023881 0.021506 -0.0345815 -0.0208932 -0.1164034 -0.0220447 -0.1484019 -0.0770985 unknown
polarizability: 88.7961612|8.3353817|61.3476346|-0.8626106|-0.2825579|57.1449203 unknown
InChI: InChI=1S/C5H11Br/c1-5(2,3)4-6/h4H2,1-3H3
charge 0 multiplicity 1
17 atoms
Br 2.538037 0.062814 -0.057537
C  -0.49098 0.017317 0.00144
C  0.741404 -0.912004 0.006297
C  -0.502761 0.941285 1.244897
C  -0.553905 0.860503 -1.296533
C  -1.724702 -0.937465 0.056333
H  0.804222 -1.509798 0.929922
H  0.769604 -1.564998 -0.880942
H  0.358889 1.631359 1.234664
H  -1.428757 1.544868 1.262456
H  -0.45942 0.353012 2.181063
H  -0.553853 0.21414 -2.194565
H  0.309878 1.544335 -1.367499
H  -1.477616 1.467591 -1.311869
H  -1.721027 -1.55353 0.975137
H  -2.655372 -0.341294 0.051701
H  -1.751942 -1.615434 -0.817365
