program: Gaussian 09
title: 000214678
version: EM64L-G09RevD.01
frameworkgroup: C1[X(C7H16O2)]
method: RPBEPBE
basis: SDD
operation: Freq
keyword: #pfreq=noraman
keyword: PBEPBE/SDD
title: #p freq=noraman PBEPBE/SDD
converged: YES YES NO NO
title: Mulliken charges:
elementType: O O C C C C C C C H H H H H H H H H H H H H H H H
charge: -0.434254 -0.435586 0.009569 -0.124847 -0.392710 -0.382127 -0.389959 -0.751077 -0.700577 0.215067 0.186399 0.187051 0.203795 0.209988 0.227294 0.200582 0.227702 0.216833 0.219056 0.214096 0.219475 0.200711 0.218423 0.327831 0.327266
chargesum: 0.00000
title: Mulliken charges with hydrogens summed into heavy atoms:
elementType: O O C C C C C C C
charge: -0.106424 -0.108320 0.224636 0.061552 -0.001863 0.055155 0.038326 -0.101092 -0.061969
polarizability: 8.59551787e+01 5.00614084e-01 7.72751332e+01 -6.51319471e-01 -4.29331950e-01 8.42321987e+01
1716.lowfreq: -7.7582 -0.0007 -0.0005 -0.0005 12.6882 27.1958 49.8660 97.6669 107.4612
frequency: 49.8212 97.6603 107.4435 108.2074 181.2850 207.3413 223.8506 234.5733 257.7821 280.6007 305.3981 316.4789 340.1308 416.9089 464.8660 510.8928 548.6101 743.9735 796.5427 854.0689 883.8451 941.1857 957.0716 969.8754 985.4549 1007.8676 1031.8885 1037.6513 1078.8283 1103.6311 1107.5442 1163.3230 1179.1022 1206.0225 1256.7299 1280.7274 1305.9818 1315.6540 1327.3306 1339.7480 1353.9344 1358.5155 1372.1646 1376.2263 1389.6560 1392.2489 1462.7712 1473.0785 1476.7818 1478.7834 1482.1571 1487.0464 1488.8417 2929.1929 2961.4838 2968.6656 2974.5500 2975.7732 2979.0766 2986.1746 3014.8744 3065.5981 3067.7333 3070.8011 3072.0327 3073.3160 3076.2873 3554.4586 3556.2390
redmass: 3.1572 2.3280 2.6611 2.5713 3.3135 1.4570 2.4055 1.4164 1.2948 1.5835 2.0837 1.1341 2.2763 2.7486 2.5593 3.5020 2.5545 1.8230 1.3859 1.9802 1.6634 2.8162 1.6579 1.7357 3.2252 1.5823 2.0062 2.1740 1.6902 1.4343 1.7215 2.0649 2.0015 1.5674 1.1962 1.2755 1.2081 1.2061 1.2925 1.3241 1.4059 1.3232 1.2935 1.3017 1.2002 1.2073 1.0722 1.0767 1.0601 1.0628 1.0481 1.0627 1.0556 1.0809 1.0638 1.0651 1.0440 1.0396 1.0702 1.0633 1.0998 1.0994 1.0996 1.1000 1.0978 1.0998 1.0977 1.0661 1.0661
irintensity: 0.6525 2.3326 3.5702 2.4385 0.5002 1.6829 20.7164 1.3343 4.0148 30.5281 15.8152 214.8418 36.5971 1.2698 7.8912 24.7683 2.5972 4.2852 5.7003 7.6501 19.2624 73.2312 37.6393 37.4211 26.6881 13.2230 22.6749 3.2616 4.3552 23.8073 1.7079 4.9489 11.8506 17.4838 1.2675 5.9128 2.3435 5.9083 4.0409 11.2828 5.3903 9.2273 1.7081 6.3736 13.8664 27.2547 0.3955 4.8337 5.4261 7.3419 18.2944 9.8875 11.5397 40.0388 3.6481 65.2341 37.3001 19.2035 39.6864 44.7817 22.2110 19.8969 31.5116 76.4335 22.7255 55.1925 56.8701 6.1622 4.3266
temp: 298.150 k
press: 1.00000 atm
elementType: 8 8 6 6 6 6 6 6 6 1 1 1 1 1 1 1 1 1 1 1 1 1 1 1 1
symmnumber: 1
zpe: 582846.7 jmol-1
zpe.correction: 0.221995 hartree
zpe.thermalcorrener: 0.233923 hartree
zpe.thermalcorrenthalpy: 0.234867 hartree
zpe.thermalcorrgfe: 0.184715 hartree
zpe.sumelectzpe: -425.989435 hartree
zpe.sumelectthermal: -425.977507 hartree
zpe.sumelectthermalent: -425.976563 hartree
zpe.sumelectthermalfe: -426.026714 hartree
dipole: 1.7998 -1.1988 -1.4948
dipole: 2.6288
quadrupole: -63.9223 -65.7169 -51.1956
quadrupole: -2.1952 1.4353 -1.0644
quadrupole: -3.6440 -5.4386 9.0826 -2.1952 1.4353 -1.0644
hfenergy: -426.2114297 hartree
pointgroup: C01 [X(C7H16O2)]
dipole: -0.7639286 0.5922178 -0.3679578 debye
dipolederiv: -0.6095634 0.089315 0.0620261 0.1023458 -0.5021823 -0.3664155 0.0723118 -0.4009661 -0.4824743 -0.5205244 -0.2467472 0.1997898 -0.2930301 -0.7478624 -0.0769991 0.2555337 -0.0561676 -0.3402419 0.1183195 0.0332952 0.0076206 0.0576111 0.0638739 -0.042163 -0.010107 -0.0208985 0.0751343 -0.0993566 0.0045291 0.036215 -0.0122333 -0.1157418 -0.0954353 -0.044077 -0.0932392 0.0193103 0.0678779 0.0317074 0.0037175 0.0226726 0.1377803 0.0317725 0.0178066 0.0328879 0.0470499 0.3075945 -0.0762821 -0.0249797 -0.0305047 0.4025723 0.1918684 -0.0237104 0.2055266 0.4723086 0.4177872 0.1979095 -0.0796318 0.2052548 0.4996386 -0.0618098 -0.1131915 -0.0560114 0.3273986 -0.0038498 0.005786 -0.0208259 0.008387 0.0794063 0.0852502 -0.0010482 0.0554635 -0.0608259 0.0344542 0.0292549 -0.0598772 0.0407579 0.0665661 0.0344074 -0.0576159 0.0217566 -0.0557886 0.0523981 -0.0425728 -0.03991 -0.057421 -0.0831112 -0.0584179 -0.0355262 -0.0780194 -0.0169292 0.0713844 0.0256429 0.0048104 -0.0008052 -0.0287042 0.1052535 -0.0225961 0.089575 -0.1834015 0.0754796 -0.0450272 -0.0480773 0.0004105 -0.1594664 -0.0907677 -0.0371509 -0.0935261 -0.0171679 -0.1259477 -0.0537029 0.0948543 -0.0883158 0.0363957 0.0616751 0.0979839 0.0524377 -0.0309363 0.1021312 -0.0050997 -0.0193272 0.0242924 -0.0105235 0.0692655 -0.0548082 0.0638619 -0.1056558 -0.147857 -0.066985 0.0241898 -0.1024538 0.0203179 -0.0263276 0.0679164 -0.0136058 0.0166139 -0.1311334 0.0773356 0.113318 0.1035949 -0.0716514 -0.0531917 0.0830195 -0.0271046 0.0183527 0.0223265 0.0029381 -0.0788367 0.0116315 0.0366133 0.0932545 -0.0409993 0.0619954 -0.0683015 -0.0916075 0.1298199 -0.0932113 0.1131547 0.0211121 0.0396201 -0.066929 0.0248225 0.0526318 -0.0896124 -0.1334036 0.094215 -0.1130429 0.0127384 0.0489382 0.046413 0.0262554 0.0477695 0.0894497 0.0058403 0.0019887 0.0076346 -0.1002172 -0.1482069 -0.0066947 -0.0749039 -0.0098905 0.0921548 -0.0164966 -0.00784 -0.0590551 -0.1262556 -0.1139103 -0.0228339 -0.0564259 0.028338 -0.0545652 -0.1020659 0.1381052 -0.0954208 0.0378051 0.0515418 0.1001095 0.044269 -0.0134 -0.1239471 0.1270039 -0.0807157 0.1330576 0.0188767 0.0412362 -0.0452926 0.0236591 0.052575 0.3645126 -0.0437071 -0.0785313 -0.0361242 0.1562319 0.2027227 -0.0465977 0.1373656 0.1237318 0.182094 0.071712 -0.1490862 0.0576015 0.3557875 0.0768386 -0.1119157 0.1309925 0.103799 unknown
polarizability: 85.7322242|1.1205427|78.2991861|1.1520495|-2.2169341|83.4311003 unknown
InChI: InChI=1S/C7H16O2/c1-3-6(2)7(4-8)5-9/h6-9H,3-5H2,1-2H3
charge 0 multiplicity 1
25 atoms
O  1.268902 -1.901128 -1.376782
O  2.019811 2.088147 0.121236
C  -0.864389 -0.521875 0.354064
C  0.458539 0.138266 -0.152651
C  -2.123591 0.337251 0.042359
C  1.588194 -0.900704 -0.339857
C  0.951788 1.289332 0.755115
C  -0.812793 -0.875343 1.862462
C  -2.49045 0.410233 -1.456955
H  -0.963795 -1.470855 -0.213596
H  0.250453 0.579396 -1.15468
H  -1.990893 1.363138 0.445484
H  -2.98195 -0.09566 0.594587
H  1.724407 -1.500125 0.576671
H  2.541626 -0.38266 -0.567917
H  0.105431 1.942313 1.053496
H  1.425003 0.899032 1.671859
H  0.090784 -1.455845 2.124164
H  -1.689963 -1.487909 2.14036
H  -0.830214 0.031959 2.495792
H  -2.665129 -0.602138 -1.866861
H  -1.690945 0.880698 -2.059456
H  -3.410812 1.002575 -1.61257
H  1.21513 -1.440732 -2.252586
H  1.647955 2.529935 -0.684234
