program: Gaussian 09
title: 000214670
version: EM64L-G09RevD.01
frameworkgroup: C1[X(C9H11NO2)]
method: RPBEPBE
basis: SDD
operation: Freq
keyword: #p
keyword: freq=noraman
keyword: PBEPBE/SDD
title: #p freq=noraman PBEPBE/SDD
converged: YES YES NO YES
title: Mulliken charges:
elementType: O O N C C C C C C C C C H H H H H H H H H H H
charge: -0.257100 -0.451814 -0.615252 -0.216517 -0.144330 0.291003 -0.333952 0.153748 -0.366740 -0.373982 -0.250041 -0.211239 0.271905 0.189124 0.223720 0.193372 0.266798 0.294671 0.274930 0.248254 0.360518 0.226142 0.226782
chargesum: 0.00000
title: Mulliken charges with hydrogens summed into heavy atoms:
elementType: O O N C C C C C C C C C
charge: -0.257100 -0.091296 -0.045652 0.055387 0.044794 0.291003 0.083140 0.153748 -0.099942 -0.125728 -0.023899 0.015543
polarizability: 1.45430010e+02 -4.86148629e+00 1.10730552e+02 3.84939209e+00 2.22440192e+00 6.14112433e+01
1716.lowfreq: -10.5739 0.0006 0.0007 0.0008 7.6480 12.2985 67.0400 113.3822 186.6822
frequency: 66.9740 113.3594 186.6782 226.1062 242.5823 255.3193 296.4719 354.9898 389.1949 420.6148 444.7740 480.0549 508.4102 535.1553 562.5220 615.3087 633.9268 653.1309 709.4789 758.4933 763.8372 831.8753 867.1076 872.9383 950.9153 964.3943 979.1252 991.9979 1024.1256 1033.5455 1082.2050 1101.2557 1132.3762 1149.0560 1165.0349 1175.2000 1186.3650 1208.3918 1247.0775 1275.5761 1295.7225 1317.3446 1339.2623 1368.3938 1385.3255 1395.5914 1442.1922 1466.1721 1477.9277 1587.2133 1620.2030 1637.0729 2869.9067 2955.9115 3035.2275 3081.4770 3130.8389 3147.9348 3163.2282 3172.4177 3437.4034 3457.1196 3589.4200
redmass: 4.7942 3.7168 3.3025 4.4225 3.1667 4.0145 1.3378 2.6183 4.4055 4.5363 3.1625 3.5151 4.7317 4.1364 1.1509 3.9997 3.8204 1.5319 3.6696 2.3795 1.8146 2.9974 1.6132 2.0588 1.3872 4.1323 1.3140 2.1433 3.7017 2.3984 2.8543 2.3539 2.2275 1.6050 1.0957 1.9974 1.2766 1.9111 1.3470 1.3739 1.3083 1.3227 1.3282 1.5526 6.4002 1.5447 2.2495 1.1920 2.5874 7.0761 7.0992 1.0979 1.0810 1.0680 1.0849 1.0975 1.0856 1.0904 1.0944 1.0998 1.0639 1.0461 1.0975
irintensity: 11.2934 0.2763 6.8449 5.3002 2.6377 4.3181 11.5952 1.5215 2.7467 0.6524 8.2827 15.4767 3.4253 3.8719 135.7813 1.5913 56.6809 191.9838 4.9346 50.1427 77.8636 2.3368 1.8497 18.2298 4.7813 39.3665 0.7488 21.2310 43.3931 24.3907 9.4830 30.7548 4.3867 30.9493 6.9693 35.8230 62.2310 62.9405 28.9387 1.4289 6.4805 11.7197 1.1348 13.9029 11.6658 8.5962 64.0152 8.9025 54.0770 25.0368 18.4026 53.6035 58.8518 77.5924 19.6888 32.4583 4.0452 15.5595 13.0714 15.8578 31.0175 0.7646 5.5514
temp: 298.150 k
press: 1.00000 atm
elementType: 8 8 7 6 6 6 6 6 6 6 6 6 1 1 1 1 1 1 1 1 1 1 1
symmnumber: 1
zpe: 489447.6 jmol-1
zpe.correction: 0.186421 hartree
zpe.thermalcorrener: 0.196750 hartree
zpe.thermalcorrenthalpy: 0.197694 hartree
zpe.thermalcorrgfe: 0.151006 hartree
zpe.sumelectzpe: -553.844941 hartree
zpe.sumelectthermal: -553.834612 hartree
zpe.sumelectthermalent: -553.833668 hartree
zpe.sumelectthermalfe: -553.880356 hartree
dipole: 3.3802 -1.4561 0.8464
dipole: 3.7766
quadrupole: -52.4035 -75.8061 -71.4886
quadrupole: -4.6554 1.3153 1.3977
quadrupole: 14.1626 -9.2401 -4.9225 -4.6554 1.3153 1.3977
hfenergy: -554.0313616 hartree
pointgroup: C01 [X(C9H11N1O2)]
dipole: -1.3271864 -0.5514858 -0.376944 debye
dipolederiv: -1.2945934 -0.4157344 -0.0695627 -0.532559 -0.6701073 -0.0646702 0.0265972 0.0056768 -0.2834672 -0.4180523 0.1012424 0.0516154 0.1904587 -0.7659903 -0.042881 0.1430489 -0.0418036 -0.5339556 -0.7466887 0.1015313 0.0061007 0.2036389 -0.6891683 -0.0823321 0.0251718 -0.0697449 -0.1764368 0.499081 -0.1327015 -0.0016899 0.0278377 0.1011974 0.0262475 -0.0258665 -0.0197298 0.0962217 0.3335685 -0.1413782 -0.0318756 -0.2398154 0.4679835 0.1016235 -0.0595401 0.0873909 0.4878326 -0.0339637 0.035991 0.0365872 -0.3380063 -0.2105385 -0.0318456 0.1200271 0.0045458 -0.0941165 0.7918068 0.1498835 0.0865955 -0.0336846 0.1272528 -0.028184 0.1553728 0.0381208 0.3872479 0.7930685 0.4993301 0.0093203 0.7909827 0.5672319 0.054421 -0.0487115 -0.0171179 0.060538 0.0895624 -0.0593277 0.0242893 0.0586517 0.0844453 -0.0129743 -0.0322364 0.0143607 -0.1188627 -0.3026589 -0.2303028 0.0119305 -0.0401435 -0.0004691 -0.025477 -0.0139672 -0.0483762 -0.176648 -0.1193024 0.12414 0.0057544 0.1033001 -0.0855938 0.0046396 0.0123095 0.0044728 -0.1968676 0.1091211 0.0305929 0.0254888 -0.0370526 0.1369045 -0.0254579 0.0306493 -0.0202648 -0.1481742 0.0394929 0.0052329 -0.0140283 0.0214676 0.0474788 -0.0059184 -0.0167046 0.0068513 -0.1031042 -0.0823534 0.0267759 -0.0895199 0.0574265 -0.0300985 -0.030518 -0.0622255 -0.0381937 -0.2154279 -0.0634843 -0.1036421 0.0175201 -0.0973708 -0.0589117 0.0386433 0.0509859 0.0716911 0.0547678 -0.0532959 -0.0279569 -0.0255226 0.0884526 0.088238 0.0524432 -0.1231635 -0.0625913 -0.1874647 0.1146853 0.0388289 -0.0126499 0.0216873 -0.0350168 0.0200713 -0.019295 0.0137579 0.1469883 0.1026939 -0.0415098 0.0109839 -0.1573013 0.2370583 0.1163849 -0.0144587 0.0771579 0.1658693 0.1733431 0.0007093 0.0180825 -0.0685817 0.3015804 -0.0828558 -0.0463138 -0.0221179 0.0299289 0.091017 0.0209874 -0.0092442 0.0426935 -0.067584 0.0242149 -0.0142827 0.0205957 0.1671036 0.1473629 0.0640807 -0.0047513 -0.0062223 0.3985929 -0.0191842 -0.0369072 -0.0197303 0.3190334 -0.0440312 -0.1032712 -0.0119386 -0.1152106 -0.0178195 0.0012478 -0.013213 0.0006732 0.1670092 -0.1263792 0.0564981 -0.0334856 0.0593507 0.0733341 0.0123616 -0.0372767 0.0143756 0.1519846 unknown
polarizability: 145.2658338|4.4047778|110.6527082|6.2469331|-1.6002622|61.6532627 unknown
InChI: InChI=1S/C9H11NO2/c10-7-5-12-8-4-2-1-3-6(8)9(7)11/h1-4,7,9,11H,5,10H2
charge 0 multiplicity 1
23 atoms
O  -0.254738 -1.949296 -0.028352
O  -1.382802 2.162672 0.187882
N  -3.444017 0.189891 -0.071894
C  -2.048518 -0.21103 0.189872
C  -1.110514 0.858725 -0.412441
C  0.34221 0.468156 -0.206946
C  -1.64694 -1.589624 -0.378975
C  0.6946 -0.899682 -0.051373
C  1.367466 1.440879 -0.169564
C  2.042242 -1.287432 0.125575
C  2.716942 1.066411 0.007739
C  3.050864 -0.302388 0.151377
H  -1.899445 -0.217181 1.285868
H  -1.328076 0.908837 -1.508657
H  -2.262816 -2.401208 0.042763
H  -1.749531 -1.592288 -1.486109
H  1.081708 2.49372 -0.25763
H  -4.139259 -0.190861 0.575456
H  -3.736571 0.111168 -1.052334
H  2.274146 -2.350188 0.244958
H  -2.379162 2.206007 0.245857
H  3.499604 1.831621 0.037965
H  4.095408 -0.604212 0.28726
