program: Gaussian 09
title: 000214677
version: EM64L-G09RevD.01
frameworkgroup: C1[X(C15H13ClN2)]
method: RPBEPBE
basis: SDD
operation: Freq
keyword: #p
keyword: freq=noraman
keyword: PBEPBE/SDD
title: #p freq=noraman PBEPBE/SDD
converged: YES YES NO NO
title: Mulliken charges:
elementType: Cl N N C C C C C C C C C C C C C C C H H H H H H H H H H H H H
charge: -0.037991 -0.697228 -0.012945 0.019161 0.600286 0.438634 -0.756158 -0.345346 -0.374129 -0.389549 -0.388813 -0.216664 -0.456335 -0.469829 0.536221 -0.229633 -0.231816 -0.245864 0.234361 0.234257 0.254398 0.252127 0.254044 0.249668 0.250401 0.223182 0.227226 0.224579 0.228424 0.313406 0.311924
chargesum: 0.00000
title: Mulliken charges with hydrogens summed into heavy atoms:
elementType: Cl N N C C C C C C C C C C C C C C C
charge: -0.037991 -0.071898 -0.012945 0.019161 0.600286 0.438634 -0.033142 -0.345346 -0.122003 -0.135506 -0.139144 -0.216664 -0.205934 -0.246646 0.536221 -0.002407 -0.007237 -0.017440
polarizability: 2.29474017e+02 -1.22258594e+01 1.55293173e+02 -2.27987904e+01 4.16837388e+00 1.48921928e+02
1716.lowfreq: -6.9654 -0.0014 -0.0003 0.0021 3.1348 6.7641 34.8386 39.2444 56.3274
frequency: 34.4474 39.2160 56.3206 99.5516 116.5389 135.3816 170.1620 186.0474 204.8703 238.0752 258.5515 297.4498 311.5636 338.0859 351.8667 374.5641 388.3911 398.9499 403.6667 427.4604 439.4893 459.2320 482.8961 517.5776 578.4554 595.3760 610.8932 616.6383 662.4929 681.1356 704.5438 721.2804 772.8468 806.7433 825.6674 853.4683 855.4451 882.3566 896.5532 927.0321 948.4042 980.9456 990.2065 995.9254 1003.2994 1019.3092 1028.6148 1046.1354 1076.2308 1082.5070 1122.4660 1165.1318 1172.5479 1192.8598 1198.4601 1217.3550 1266.3059 1321.2073 1329.4686 1367.8121 1379.3742 1387.6524 1428.8497 1436.5811 1474.9793 1478.0619 1484.3083 1503.8199 1562.0299 1593.3807 1610.8406 1631.3699 1646.0772 2182.7155 2995.0813 3099.8269 3106.1357 3120.8427 3127.0356 3130.5960 3137.7640 3147.4715 3151.9337 3163.8138 3168.6114 3566.1658 3705.5838
redmass: 4.0409 6.6802 5.5910 6.0341 8.0252 6.3447 5.9717 5.3556 4.6341 4.3188 4.8853 3.1177 2.2666 1.4261 3.8423 1.0748 1.2330 7.3446 2.8285 4.4480 5.8473 3.7656 4.8817 3.7583 5.5918 4.2869 4.0486 6.3703 5.6069 7.2522 1.7183 3.6150 1.8683 1.6603 2.5740 1.6305 1.2713 3.9127 2.7376 1.4502 1.3654 1.3863 5.6252 1.3886 3.4971 2.5349 1.9324 2.0864 1.7060 1.7360 2.1954 1.4077 1.0528 1.1178 3.3292 2.2557 1.6819 1.3404 2.3184 4.5892 8.0642 1.1816 3.9721 2.2591 1.2293 1.2375 1.3888 3.4533 6.5711 6.2724 6.0060 2.9876 1.4870 12.6638 1.0344 1.1017 1.1003 1.0852 1.0872 1.0894 1.0918 1.0962 1.0921 1.1015 1.0933 1.0451 1.1041
irintensity: 0.4087 1.1548 0.6367 1.2751 3.1788 0.5617 0.2537 4.1816 2.7926 1.7552 0.7571 0.0003 0.8798 0.1127 3.8816 29.0988 270.1141 8.8617 0.0798 1.9125 0.7390 5.0070 3.7461 7.5160 14.2497 5.5352 5.9463 0.2972 4.5770 6.9069 54.1702 0.4519 41.3056 24.6271 12.3094 38.3325 1.8950 19.3702 14.9665 2.7029 0.0842 0.1372 0.5858 0.5611 10.0182 10.5390 15.9916 3.1495 24.8921 12.4151 3.6697 5.4338 0.0938 3.9318 11.3565 1.9698 52.2713 1.7686 32.1658 27.3690 0.6672 13.9838 3.1137 14.3381 8.5377 17.9105 28.0770 92.7515 28.2773 0.6140 10.9760 77.4181 370.2083 7.7591 13.6648 25.3341 18.4841 3.1767 0.1619 16.3547 12.4389 30.1483 6.5248 27.4970 9.0136 97.7300 24.0283
temp: 298.150 k
press: 1.00000 atm
elementType: 17 7 7 6 6 6 6 6 6 6 6 6 6 6 6 6 6 6 1 1 1 1 1 1 1 1 1 1 1 1 1
symmnumber: 1
zpe: 626050.0 jmol-1
zpe.correction: 0.238450 hartree
zpe.thermalcorrener: 0.254951 hartree
zpe.thermalcorrenthalpy: 0.255896 hartree
zpe.thermalcorrgfe: 0.194221 hartree
zpe.sumelectzpe: -1147.684526 hartree
zpe.sumelectthermal: -1147.668025 hartree
zpe.sumelectthermalent: -1147.667080 hartree
zpe.sumelectthermalfe: -1147.728755 hartree
dipole: 3.9588 -4.0918 -3.4008
dipole: 6.6318
quadrupole: -80.4559 -121.4275 -109.3968
quadrupole: -4.3236 -1.4137 -7.7088
quadrupole: 23.3042 -17.6674 -5.6367 -4.3236 -1.4137 -7.7088
hfenergy: -1147.9229759 hartree
pointgroup: C01 [X(C15H13Cl1N2)]
dipole: -1.5172405 1.8155999 -1.0996875 debye
polarizability: 229.0491079|-17.3691179|157.265688|19.7522539|-3.6360381|147.3743222 unknown
InChI: InChI=1S/C15H13ClN2/c1-15(10-17,11-5-3-2-4-6-11)13-8-7-12(18)9-14(13)16/h2-9H,18H2,1H3
charge 0 multiplicity 1
31 atoms
Cl -0.274384 -0.188999 2.388964
N  -4.803536 1.303353 0.35458
N  0.712923 -3.31371 0.693075
C  0.476093 -0.990492 -0.623424
C  -0.925055 -0.386215 -0.357209
C  1.618734 0.00322 -0.266755
C  0.678438 -1.391739 -2.125927
C  -1.361916 0.011093 0.93398
C  -1.865565 -0.187396 -1.402065
C  2.832318 -0.437219 0.312167
C  1.482363 1.365697 -0.630578
C  0.60605 -2.257221 0.149022
C  -2.624951 0.564943 1.188748
C  -3.13993 0.367462 -1.188999
C  -3.54569 0.75509 0.119159
C  3.891667 0.471892 0.530568
C  2.54076 2.274091 -0.412643
C  3.751498 1.830703 0.168113
H  -0.069853 -2.134515 -2.45234
H  0.618058 -0.496739 -2.768357
H  1.682082 -1.830129 -2.249494
H  -1.597801 -0.477056 -2.421643
H  2.945186 -1.485756 0.611032
H  0.541239 1.719614 -1.067653
H  -2.896448 0.845356 2.211474
H  -3.82537 0.496752 -2.034581
H  4.82262 0.119085 0.988383
H  2.419631 3.326868 -0.692076
H  4.571918 2.536144 0.341075
H  -5.092864 1.565879 1.292205
H  -5.466918 1.426542 -0.4046
