program: Gaussian 09
title: 000214666
version: EM64L-G09RevD.01
frameworkgroup: C1[X(C2H6N4O2S)]
method: RPBEPBE
basis: SDD
operation: Freq
keyword: #p
keyword: freq=noraman
keyword: PBEPBE/SDD
title: #p freq=noraman PBEPBE/SDD
converged: YES YES NO NO
title: Mulliken charges:
elementType: S O O N N N N C C H H H H H H
charge: 1.071970 -0.485494 -0.486760 -0.288491 -0.228405 0.033753 -0.019149 -0.576960 -0.576768 0.251119 0.249734 0.277259 0.251643 0.277192 0.249357
chargesum: 0.00000
title: Mulliken charges with hydrogens summed into heavy atoms:
elementType: S O O N N N N C C
charge: 1.071970 -0.485494 -0.486760 -0.288491 -0.228405 0.033753 -0.019149 0.201152 0.201423
polarizability: 1.57497142e+02 -1.20997955e+00 7.61449148e+01 2.15818232e-01 5.83966699e-02 7.12915507e+01
1716.lowfreq: -11.7900 -9.7229 -3.4797 -0.0023 -0.0016 -0.0013 10.4204 68.7956 72.3775
frequency: -9.2938 68.7817 72.3514 128.1220 167.5398 181.5911 196.5727 199.7899 238.1190 243.4556 312.6333 378.1452 381.9326 412.2081 495.4132 502.0044 573.3081 841.2031 861.5484 969.0573 1011.9199 1075.7181 1100.0494 1175.3951 1178.7649 1215.5156 1408.6251 1421.5478 1441.0945 1458.2016 1463.4370 1481.2949 1903.4179 2966.3342 2969.3092 3064.6327 3065.9262 3112.5326 3114.4685
redmass: 8.7466 3.7321 4.4223 5.8167 1.1425 5.5092 4.0955 1.2772 8.4893 6.7051 4.3395 3.4952 4.7704 14.3886 5.6873 13.9655 13.4442 17.3438 4.2688 15.2502 1.5268 1.2325 1.3643 13.3984 4.3955 1.6728 1.1264 1.1371 1.0420 1.0393 1.0491 1.0540 13.9979 1.0360 1.0365 1.0994 1.0979 1.0991 1.1005
irintensity: 0.1299 1.1841 2.8759 1.4524 0.0455 1.0847 4.3389 3.4450 8.0583 1.7256 5.2256 11.5330 0.0092 133.8337 48.6485 0.7770 2.1819 65.8526 26.9132 72.5775 0.5505 0.4862 5.0967 88.1420 11.6014 22.5446 19.0355 1.6840 26.3864 28.8592 2.4572 35.2359 400.1550 9.8371 36.9794 0.4997 19.1418 2.4029 1.5534
temp: 298.150 k
press: 1.00000 atm
elementType: 16 8 8 7 7 7 7 6 6 1 1 1 1 1 1
symmnumber: 1
zpe: 256311.7 jmol-1
zpe.correction: 0.097624 hartree
zpe.thermalcorrener: 0.108389 hartree
zpe.thermalcorrenthalpy: 0.109333 hartree
zpe.thermalcorrgfe: 0.061050 hartree
zpe.sumelectzpe: -846.356673 hartree
zpe.sumelectthermal: -846.345907 hartree
zpe.sumelectthermalent: -846.344963 hartree
zpe.sumelectthermalfe: -846.393247 hartree
dipole: -4.4278 -3.7679 -0.0986
dipole: 5.8148
quadrupole: -60.3376 -64.4842 -61.7762
quadrupole: 4.7889 0.0335 -0.1379
quadrupole: 1.8617 -2.2849 0.4231 4.7889 0.0335 -0.1379
hfenergy: -846.4542966 hartree
pointgroup: C01 [X(C2H6N4O2S1)]
dipole: 1.8245896 -0.4097547 1.3178289 debye
dipolederiv: 1.6175424 0.0166161 -0.1010957 0.1057399 1.1458881 -0.0802961 -0.4664835 -0.0791619 1.428377 -0.4881276 -0.0093993 0.0195691 -0.0571329 -0.6149821 0.1714856 0.0232213 0.0522385 -0.523719 -0.4831269 -0.0045125 0.0078007 0.0389335 -0.4967907 -0.1576091 0.0466486 -0.0325032 -0.6438722 -0.2369872 -0.0313043 0.0929953 -0.07275 -0.3872314 0.0202267 0.2488649 0.0169514 -0.4676531 -1.5725556 -0.0216312 0.1603959 -0.0268547 -0.2004412 -0.0188489 0.1473267 -0.0231194 -0.1302122 1.8886059 0.0369962 -0.2219598 -0.1267065 0.0016974 0.0351668 0.4722277 0.0252191 -0.1275711 -0.9945234 -0.0218821 0.1317982 0.0403892 -0.0434861 -0.0031704 -0.1457668 0.0004979 -0.0329275 -0.0270123 0.052615 -0.1148991 -0.1829075 0.1961254 -0.161928 -0.193076 -0.0533149 0.1254986 -0.0113323 0.0186483 -0.1121822 0.2632956 0.0712611 0.1418456 -0.0704896 0.0325616 0.2398224 0.0829058 -0.0328308 0.1103549 0.0836627 0.0242391 0.0232281 0.0431037 0.0931755 -0.0683905 -0.0686555 0.018312 -0.0169185 0.0618842 0.0662817 0.0365433 -0.0226268 0.0411477 0.123571 0.1419014 -0.081173 -0.0450053 -0.0138628 0.0626036 -0.0223953 -0.0180388 -0.0797021 0.0209396 0.0761689 -0.0288907 0.1120089 -0.0952753 0.0585246 0.0412162 -0.0083462 -0.022031 -0.0960827 0.1478424 0.0849462 0.0017871 0.0125155 0.0002637 0.014221 -0.0056173 0.0711904 0.0759093 -0.0726462 0.0034901 -0.0246495 -0.0309308 0.1160468 -0.0396854 -0.0509479 -0.0431494 0.0763105 unknown
polarizability: 157.0622304|0.2274649|71.6863498|-6.0643804|-1.3451366|76.1850271 unknown
InChI: InChI=1S/C2H6NO2S.N3/c1-3(2)6(4)5;1-3-2/h1-2H3;
charge 0 multiplicity 1
15 atoms
S  0.256998 0.225554 -0.797143
O  0.096196 1.789053 -1.166341
O  0.003155 -0.934163 -1.891645
N  1.917791 -0.029852 -0.050495
N  -0.867147 -0.210498 0.980236
N  -2.118522 -0.157564 0.790845
N  -3.309832 -0.129035 0.697019
C  2.162795 -1.444824 0.309501
C  2.240504 0.991244 0.971962
H  1.672653 -1.739221 1.258761
H  3.256866 -1.561149 0.410667
H  1.817488 -2.096518 -0.508704
H  1.749799 0.795767 1.946141
H  1.952047 1.98715 0.600003
H  3.337305 0.972056 1.103893
