program: Gaussian 09
title: 000214681
version: EM64L-G09RevD.01
frameworkgroup: C1[X(C16H17NO2S)]
method: RPBEPBE
basis: SDD
operation: Freq
keyword: #p
keyword: freq=noraman
keyword: PBEPBE/SDD
title: #p freq=noraman PBEPBE/SDD
converged: YES YES NO NO
title: Mulliken charges:
elementType: S O O N C C C C C C C C C C C C C C C C H H H H H H H H H H H H H H H H H
charge: 0.215442 -0.262850 -0.230035 -0.027847 -0.277411 -0.445452 -0.434612 -0.451323 0.346441 -0.412341 0.228371 -0.411742 0.416855 0.327521 -0.358450 -0.409367 -0.792431 -0.257447 -0.235237 -0.505226 0.267529 0.221247 0.224343 0.253637 0.208876 0.236129 0.227377 0.229220 0.230494 0.209341 0.242602 0.249691 0.229634 0.229327 0.238619 0.244821 0.234250
chargesum: 0.00000
title: Mulliken charges with hydrogens summed into heavy atoms:
elementType: S O O N C C C C C C C C C C C C C C C C
charge: 0.215442 -0.262850 -0.230035 -0.027847 -0.009882 0.000137 0.027901 0.012184 0.346441 -0.412341 0.228371 -0.411742 0.416855 0.327521 -0.129230 -0.178874 -0.090796 -0.027813 -0.005910 0.212464
polarizability: 2.97275074e+02 -1.85786332e+01 2.21244888e+02 -1.01994236e+01 -1.21350514e+01 1.15172299e+02
1716.lowfreq: -10.4232 -3.9451 -0.0021 -0.0016 -0.0014 4.0926 11.1686 18.5681 36.9258
frequency: 10.1264 18.3500 36.7388 68.1102 78.6494 92.8277 111.2343 138.1563 147.5349 192.7158 194.8298 199.8627 228.3033 246.9661 257.3693 292.0555 310.0761 330.2300 337.0396 359.3577 423.1607 440.8146 453.0284 465.9608 495.8504 533.1860 584.5136 598.9416 631.0799 642.2598 651.0059 689.2917 715.7436 725.3766 727.7781 771.8010 777.9582 822.0992 841.3278 869.0010 874.2307 886.3380 902.7674 933.7135 948.7864 982.1080 987.1552 995.5350 1017.3711 1046.4058 1054.8113 1066.7752 1094.5622 1110.6343 1113.1240 1129.4338 1136.3385 1147.8452 1156.3349 1175.5620 1178.8109 1200.0379 1219.4891 1245.5746 1262.5627 1287.5393 1300.7798 1331.8242 1337.1256 1354.4450 1359.7616 1364.4299 1405.3920 1420.4074 1421.6986 1451.6614 1453.3354 1453.7194 1464.0301 1468.2482 1468.5020 1470.9829 1475.4316 1512.8390 1555.4838 1572.8840 1611.8593 1642.4791 2967.1849 2989.2018 2990.2253 3003.3418 3004.4509 3028.9348 3045.6824 3052.9518 3068.1450 3073.4641 3089.9075 3106.2587 3121.3955 3127.0353 3143.2491 3149.4153 3164.3414
redmass: 3.8355 4.4012 5.3808 6.5727 4.0146 1.1401 4.3047 3.5681 3.1724 4.0054 1.1062 3.2732 4.6853 4.4352 3.3455 5.1209 3.1329 3.0842 5.2273 5.3622 3.4867 3.3307 5.1449 3.1225 4.1911 4.8953 5.3621 4.9040 7.3223 8.2685 5.3967 3.9933 4.6551 2.2819 4.2593 1.6832 4.9600 2.8497 3.8278 1.3473 1.9397 2.6223 4.1465 4.9379 1.3903 2.7125 1.3386 1.6138 3.5867 1.5740 2.2721 2.0494 2.2578 3.6971 1.3025 1.8074 1.8595 1.4478 1.2791 1.9832 1.0953 2.4458 2.1159 1.2725 1.7578 1.5063 1.8107 1.5448 1.4771 1.5554 2.1894 6.2134 1.2977 1.1958 1.8357 1.0502 1.0538 1.1169 1.0508 1.0872 1.1918 1.0874 2.6301 8.5937 6.8198 6.2460 6.0034 8.6646 1.0643 1.0363 1.0621 1.0623 1.0300 1.0942 1.0842 1.1003 1.1038 1.0957 1.1011 1.1044 1.0858 1.0888 1.0936 1.1048 1.1008
irintensity: 0.2540 1.4258 0.5358 1.4177 1.4507 0.2945 1.0135 2.5662 1.7186 0.8024 1.0080 3.1978 7.5734 1.6963 1.8750 4.7092 2.2089 5.6773 7.4882 0.9436 1.5545 7.7135 2.5812 0.6436 1.1289 0.1934 1.3895 0.6957 10.8888 41.5258 4.3194 0.6569 5.0685 12.9838 21.6624 54.0232 8.9323 1.2067 4.8082 0.3048 7.2319 0.7638 35.1117 29.4545 0.7477 3.0672 0.0138 1.0908 6.2906 9.7499 13.6989 20.6229 2.5194 273.9730 10.5971 0.3819 27.7456 14.8686 9.3086 13.8471 1.7089 10.0745 2.7955 1.6921 20.4427 1.7104 19.4964 1.0387 27.8719 2.5541 7.4329 0.8638 13.8183 18.9661 3.8832 13.6376 12.5321 6.0586 12.3496 12.0187 36.4011 11.2237 40.8332 11.4213 38.2139 5.5937 2.4673 128.8563 30.6447 20.9768 29.3790 36.0383 36.4942 23.8597 6.8720 47.3698 31.5955 10.8382 31.2093 24.8584 11.5594 4.5725 28.4800 16.6867 33.1379
temp: 298.150 k
press: 1.00000 atm
elementType: 16 8 8 7 6 6 6 6 6 6 6 6 6 6 6 6 6 6 6 6 1 1 1 1 1 1 1 1 1 1 1 1 1 1 1 1 1
symmnumber: 1
zpe: 769719.6 jmol-1
zpe.correction: 0.293171 hartree
zpe.thermalcorrener: 0.312126 hartree
zpe.thermalcorrenthalpy: 0.313070 hartree
zpe.thermalcorrgfe: 0.243128 hartree
zpe.sumelectzpe: -1221.721166 hartree
zpe.sumelectthermal: -1221.702211 hartree
zpe.sumelectthermalent: -1221.701267 hartree
zpe.sumelectthermalfe: -1221.771209 hartree
dipole: 1.4269 0.0600 -1.1143
dipole: 1.8114
quadrupole: -104.4964 -108.6949 -131.8922
quadrupole: 0.0687 -3.8893 1.6228
quadrupole: 10.5314 6.3330 -16.8643 0.0687 -3.8893 1.6228
hfenergy: -1222.0143367 hartree
pointgroup: C01 [X(C16H17N1O2S1)]
dipole: -0.5820977 0.0672759 0.4056308 debye
polarizability: 298.0480861|17.3056848|222.5562539|-2.8452398|2.3817497|113.0879218 unknown
InChI: InChI=1S/C16H17NO2S/c1-10-6-3-4-7-11(10)15-17-14-12(16(18)19-2)8-5-9-13(14)20-15/h3-4,6-7,12H,5,8-9H2,1-2H3
charge 0 multiplicity 1
37 atoms
S  0.680837 -2.433763 -0.260612
O  -3.434472 2.114569 -0.166274
O  -2.933418 0.575777 -1.840264
N  0.012844 0.090325 0.307375
C  -2.501452 0.017026 0.551019
C  -3.589937 -1.065795 0.845904
C  -3.537517 -2.231636 -0.16948
C  -2.182887 -2.988385 -0.098138
C  -1.172396 -0.650117 0.27585
C  -1.048378 -2.001543 -0.010329
C  -2.943831 0.888571 -0.628752
C  1.097039 -0.632468 0.062894
C  2.497276 -0.186474 0.031289
C  2.854759 1.207342 0.042654
C  3.533511 -1.165493 -0.013685
C  4.233136 1.540934 0.006824
C  1.838113 2.330579 0.082261
C  4.891992 -0.806256 -0.050011
C  5.247829 0.561682 -0.038783
C  -3.943794 3.035505 -1.212578
H  -2.402227 0.685089 1.423985
H  -4.590473 -0.595474 0.845038
H  -3.414495 -1.453413 1.868566
H  -3.678467 -1.833191 -1.190829
H  -4.362266 -2.940654 0.030157
H  -2.068525 -3.639342 -0.9853
H  -2.166164 -3.657809 0.786753
H  3.266644 -2.228869 -0.00804
H  4.510139 2.601872 0.012558
H  2.344785 3.308935 0.014418
H  1.106506 2.246228 -0.74082
H  1.236467 2.298411 1.007078
H  5.66371 -1.582597 -0.081794
H  6.301047 0.862283 -0.065179
H  -4.776088 2.566342 -1.764021
H  -3.13756 3.286695 -1.921795
H  -4.281586 3.925111 -0.663041
