program: Gaussian 09
title: 000214675
version: EM64L-G09RevD.01
frameworkgroup: C1[X(C15H20N2O)]
method: RPBEPBE
basis: SDD
operation: Freq
keyword: #p
keyword: freq=noraman
keyword: PBEPBE/SDD
title: #p freq=noraman PBEPBE/SDD
converged: YES YES NO NO
title: Mulliken charges:
elementType: O N N C C C C C C C C C C C C C C C H H H H H H H H H H H H H H H H H H H H
charge: -0.265053 -0.099250 -0.121497 -0.379075 -0.345283 -0.334759 -0.322317 0.060576 -0.259307 0.382721 -0.689397 -0.381962 -0.375600 0.330651 -0.366286 -0.378368 -0.241257 -0.686625 0.222263 0.212849 0.210838 0.213247 0.196032 0.196966 0.261002 0.259941 0.220007 0.215113 0.213262 0.210308 0.278149 0.238502 0.245550 0.205105 0.204907 0.204281 0.231868 0.231898
chargesum: 0.00000
title: Mulliken charges with hydrogens summed into heavy atoms:
elementType: O N N C C C C C C C C C C C C C C C
charge: -0.265053 -0.099250 -0.121497 0.056038 0.078802 0.058239 -0.061315 0.060576 0.000634 0.382721 -0.041014 -0.171654 -0.097451 0.330651 -0.127784 -0.132819 0.168755 -0.018578
polarizability: 3.06056594e+02 1.42771951e+01 1.64264657e+02 -1.07141398e+01 1.68896399e+01 1.11245347e+02
1716.lowfreq: -5.3761 -0.0009 -0.0007 0.0004 0.9490 7.6939 22.2181 24.4200 43.3414
frequency: 21.7416 24.4031 43.3351 62.1858 73.4934 90.8160 99.4827 113.4515 115.4956 164.4563 182.2875 208.1131 236.3478 241.9269 251.6930 300.6571 321.8794 372.7029 385.9786 412.6586 423.2018 439.9451 481.4462 522.9706 617.4104 628.8225 635.4209 683.2379 723.2018 729.1391 737.8363 754.3188 776.8944 792.2756 793.5725 802.9427 831.2405 855.4988 902.1900 903.4615 914.7892 926.2895 931.7691 988.8774 998.9783 1010.5384 1031.1938 1038.1431 1046.7910 1072.9560 1105.3498 1110.1728 1115.2468 1117.8693 1135.7683 1175.9617 1185.0120 1203.7959 1209.1061 1221.2159 1261.0429 1263.9979 1268.9599 1276.0754 1289.4903 1308.9016 1342.1912 1355.2703 1358.8822 1364.7160 1372.0459 1383.1259 1392.5812 1398.2878 1423.5137 1438.3354 1460.2419 1469.3836 1472.3989 1476.6016 1478.1169 1481.1494 1485.4581 1492.0450 1494.6574 1558.9554 1577.4004 1628.8594 2949.0623 2965.2148 2976.6381 2983.5304 2995.7436 2997.5118 3005.7976 3008.2132 3037.1285 3064.3651 3074.5747 3077.5341 3092.8794 3104.9884 3123.6014 3150.2028 3158.8346 3170.9524 3224.9924 3234.8831
redmass: 3.4850 3.6489 4.2409 3.9065 2.0769 2.4092 4.9193 2.3065 1.7614 3.4228 4.0667 4.4430 1.1236 1.3558 3.2682 3.1577 4.0386 4.7205 3.7434 2.9595 3.9203 4.3508 3.9524 2.5677 3.7231 4.2494 5.7332 2.4018 2.3535 3.8005 1.0956 2.5174 4.5855 1.4329 1.2492 1.3742 1.1234 1.5432 1.7535 3.2312 7.0161 1.2138 1.4013 1.3448 3.0677 4.6788 3.6404 2.8857 2.4821 2.4996 1.6193 1.5307 2.1904 1.8819 1.4397 1.3697 1.6648 1.5530 1.6114 2.9418 1.1423 1.6603 1.8047 1.4783 1.0693 1.4955 1.4362 1.9470 2.4134 2.3712 1.8534 2.8241 1.2119 1.2847 4.1430 2.6918 1.0401 1.2789 1.1435 1.1337 1.0421 1.1757 1.2400 1.1276 1.3059 5.3933 7.6069 6.3833 1.0553 1.0592 1.0365 1.0593 1.0362 1.0598 1.1073 1.0998 1.1023 1.1049 1.1013 1.0995 1.0988 1.1013 1.0882 1.0879 1.0941 1.0970 1.0963 1.1008
irintensity: 0.6276 0.0533 0.2322 1.6405 0.7739 0.8538 0.0340 0.1865 2.9727 2.4801 2.3152 0.8954 0.0677 0.1955 2.7730 0.8227 1.0703 0.6585 0.8212 0.0058 0.5891 0.0885 2.0766 14.9119 15.4516 11.8945 17.9179 0.2662 7.9232 12.2121 8.4114 3.4089 1.8283 61.6886 20.9830 16.2471 0.1140 46.6307 9.9760 48.2906 11.5251 1.8822 0.3216 0.5296 5.6821 6.8445 14.0101 73.6107 9.7531 0.1738 0.9976 8.6633 16.7977 12.1349 4.2545 167.0353 10.3222 13.3180 34.3053 224.4064 0.0714 12.8517 15.4086 3.8613 1.2023 0.9119 16.3557 60.9109 7.8365 11.2003 20.3018 18.5126 10.0866 46.6859 1.0451 58.3727 11.4673 59.1811 35.4829 26.2746 12.1802 13.0469 31.5005 16.8407 10.1201 47.6218 7.2406 43.6612 42.6346 28.4507 30.8567 12.5723 34.9659 78.1481 40.6838 7.3598 4.7590 10.2177 92.4514 53.2282 30.8726 35.6400 21.3681 4.3659 20.0827 6.1622 4.2347 0.3763
temp: 298.150 k
press: 1.00000 atm
elementType: 8 7 7 6 6 6 6 6 6 6 6 6 6 6 6 6 6 6 1 1 1 1 1 1 1 1 1 1 1 1 1 1 1 1 1 1 1 1
symmnumber: 1
zpe: 838984.7 jmol-1
zpe.correction: 0.319552 hartree
zpe.thermalcorrener: 0.337850 hartree
zpe.thermalcorrenthalpy: 0.338794 hartree
zpe.thermalcorrgfe: 0.270658 hartree
zpe.sumelectzpe: -766.969715 hartree
zpe.sumelectthermal: -766.951418 hartree
zpe.sumelectthermalent: -766.950474 hartree
zpe.sumelectthermalfe: -767.018610 hartree
dipole: 3.5721 -3.8515 -1.5815
dipole: 5.4859
quadrupole: -77.3857 -106.1706 -111.2040
quadrupole: 9.3015 -0.5572 2.8191
quadrupole: 20.8677 -7.9172 -12.9506 9.3015 -0.5572 2.8191
hfenergy: -767.2892676 hartree
pointgroup: C01 [X(C15H20N2O1)]
dipole: -1.4166471 -1.571639 0.4259467 debye
polarizability: 306.2555183|-13.3037921|167.5037823|-9.690103|-10.5516476|107.8072972 unknown
InChI: InChI=1S/C15H20N2O/c1-3-5-10-17-11-15(16-12-17)13-6-8-14(9-7-13)18-4-2/h6-9,11-12H,3-5,10H2,1-2H3
charge 0 multiplicity 1
38 atoms
O  4.994212 -0.141406 -0.107163
N  -2.868472 0.633658 0.660536
N  -1.167708 2.017179 0.081353
C  -4.240229 0.15047 0.900879
C  -4.815618 -0.667228 -0.278409
C  -6.260969 -1.139825 -0.003019
C  -1.695526 -0.130372 0.706793
C  -0.644082 0.730961 0.35027
C  -2.494263 1.918903 0.27449
C  0.797609 0.454422 0.245965
C  -6.849159 -1.956516 -1.173528
C  1.34506 -0.826115 0.51352
C  1.689535 1.497903 -0.134552
C  3.600525 -0.018479 0.029244
C  2.731157 -1.072261 0.409802
C  3.069929 1.26824 -0.242586
C  5.596268 -1.459792 0.163143
C  7.099479 -1.312616 -0.059017
H  -4.246783 -0.459403 1.824292
H  -4.876922 1.034808 1.090026
H  -4.16622 -1.544014 -0.470114
H  -4.789842 -0.047357 -1.195833
H  -6.279549 -1.751822 0.922063
H  -6.905314 -0.25828 0.192706
H  -1.711487 -1.179544 0.989478
H  -3.213584 2.726721 0.157876
H  -7.88269 -2.282285 -0.956963
H  -6.870665 -1.358102 -2.103365
H  -6.243921 -2.861044 -1.371173
H  0.686795 -1.652085 0.808689
H  1.26812 2.486613 -0.340272
H  3.115204 -2.073973 0.62482
H  3.758485 2.067379 -0.534516
H  5.371822 -1.763164 1.207062
H  5.160113 -2.214679 -0.524031
H  7.608406 -2.275871 0.127987
H  7.309766 -0.999974 -1.096058
H  7.520616 -0.554749 0.623406
