program: Gaussian 09
title: 000214698
version: EM64L-G09RevD.01
frameworkgroup: C1[X(C15H16N2O5)]
method: RPBEPBE
basis: SDD
operation: Freq
keyword: #p
keyword: freq=noraman
keyword: PBEPBE/SDD
title: #p freq=noraman PBEPBE/SDD
converged: YES YES NO NO
title: Mulliken charges:
elementType: O O O O O N N C C C C C C C C C C C C C C C H H H H H H H H H H H H H H H H
charge: -0.211427 -0.219438 -0.231392 -0.415795 -0.217081 -0.200943 -0.371600 -0.014589 -0.389240 0.406174 0.173671 0.116553 -0.367007 0.206153 -0.385037 -0.383736 -0.701951 -0.437168 -0.235681 -0.234996 -0.240153 0.232479 0.230397 0.229896 0.219375 0.218056 0.366714 0.275953 0.263329 0.286988 0.294184 0.216053 0.215034 0.218263 0.231512 0.231401 0.234289 0.390764
chargesum: 0.00000
title: Mulliken charges with hydrogens summed into heavy atoms:
elementType: O O O O O N N C C C C C C C C C C C C C C C
charge: -0.211427 -0.219438 -0.231392 -0.025031 -0.217081 -0.200943 -0.004887 -0.014589 0.071053 0.406174 0.173671 0.116553 0.070423 0.206153 -0.109084 -0.120407 -0.052602 0.144004 -0.004169 -0.003595 -0.005864 0.232479
polarizability: 2.11965856e+02 4.19639870e+00 1.74050776e+02 -6.10052733e+00 1.26086989e+01 1.69494431e+02
1716.lowfreq: -24.5059 -1.0216 -0.0007 -0.0006 -0.0005 5.0669 8.5011 24.9690 31.7446
frequency: -23.8941 24.8515 31.7276 44.9729 63.0955 70.5142 72.6601 106.4674 112.0078 153.2877 164.8248 168.0070 217.9964 236.0566 266.1499 272.0154 287.9455 298.6416 311.7375 330.7297 341.4331 379.5719 402.4781 416.9247 467.6625 476.0489 508.4487 531.0147 539.3938 577.1083 612.6093 615.1124 642.2019 656.8870 677.3028 698.8289 703.9592 709.7661 738.6109 745.0543 764.9474 773.9978 819.5667 840.1575 859.3210 875.5689 895.6408 927.7402 935.6573 953.5769 987.1417 989.6089 1002.3409 1014.9535 1033.1498 1050.2478 1078.2412 1094.7029 1106.2293 1112.9020 1135.0230 1143.6854 1164.9526 1177.5623 1200.0652 1208.9673 1259.7736 1277.4764 1298.4842 1307.2884 1312.1846 1323.1284 1330.4164 1348.6272 1358.4322 1375.4331 1376.8268 1384.0408 1393.3993 1420.9618 1435.6950 1446.1789 1472.7950 1479.4131 1481.6088 1484.6434 1586.9633 1590.9106 1605.1924 1640.6289 1660.2635 1677.5911 2976.6871 2986.8122 3015.9000 3034.8506 3041.7484 3071.4301 3076.8222 3085.0878 3115.2146 3129.5997 3138.2902 3150.9805 3158.2602 3169.6077 3518.5457 3527.7938
redmass: 3.8307 6.5845 7.0596 8.3112 5.8992 4.8193 2.7022 6.0650 2.0644 7.1151 8.3267 8.4555 5.2573 1.2302 2.8168 3.2256 3.3124 3.6573 5.8443 3.7793 8.6497 9.6743 2.8841 11.9154 3.4878 2.4007 6.0150 4.5085 5.5600 3.6733 5.9467 6.0023 1.7098 2.9249 2.9465 7.4674 1.9806 7.4372 1.6324 2.4313 1.7485 1.9522 5.3369 1.5854 1.2460 4.0699 2.2775 2.3546 1.4310 2.2306 1.4644 4.7393 1.3375 3.2873 2.4498 3.0937 2.1763 1.6687 3.8445 2.3294 3.1612 3.4873 2.6479 1.0726 3.8589 1.1317 1.3271 1.9291 1.3202 2.1994 1.2577 2.0890 1.3765 1.5107 1.4920 5.0225 4.0159 2.1827 1.2090 1.1127 2.2606 1.0870 1.0650 1.0412 2.0375 1.0695 9.0687 6.9096 5.7975 6.3179 8.6266 9.2769 1.0355 1.0592 1.0593 1.1008 1.0607 1.1015 1.0992 1.1038 1.1013 1.0850 1.0882 1.0924 1.0953 1.1013 1.0768 1.0643
irintensity: 0.0375 0.1893 0.3293 0.7457 0.4134 1.4804 0.3136 0.8625 0.2358 0.4312 4.9820 9.9460 0.1348 0.3329 2.6668 2.9812 0.9115 2.0520 5.5487 1.1530 11.7089 8.4277 0.1272 6.8562 4.5679 26.4972 26.6712 19.4515 38.3969 67.3501 4.5619 2.7836 105.6618 27.7060 6.6122 0.7488 42.2764 7.4855 2.3936 11.2757 45.5076 97.6256 25.5020 2.6716 0.4597 2.5897 0.7682 25.7947 0.4266 9.1537 0.4484 1.5964 0.3344 13.0225 20.7942 1.0163 177.6755 14.6815 3.7990 16.4228 11.9753 0.6298 2.5602 0.6655 41.8476 8.8376 16.2574 76.2877 2.6882 33.0132 10.2220 209.0316 13.9550 56.9149 18.6004 98.8313 76.7893 72.3019 8.1105 55.7392 9.9009 26.8447 1.2910 13.5875 35.7436 14.3065 172.1892 91.8740 13.6092 370.6624 278.4823 253.9490 40.3557 17.5882 19.8333 1.7942 11.0257 17.6358 43.8432 36.7206 3.2722 0.0497 8.4435 6.5900 13.3355 25.0011 70.4850 37.1084
temp: 298.150 k
press: 1.00000 atm
elementType: 8 8 8 8 8 7 7 6 6 6 6 6 6 6 6 6 6 6 6 6 6 6 1 1 1 1 1 1 1 1 1 1 1 1 1 1 1 1
symmnumber: 1
zpe: 767679.8 jmol-1
zpe.correction: 0.292394 hartree
zpe.thermalcorrener: 0.312181 hartree
zpe.thermalcorrenthalpy: 0.313125 hartree
zpe.thermalcorrgfe: 0.242857 hartree
zpe.sumelectzpe: -1065.263613 hartree
zpe.sumelectthermal: -1065.243826 hartree
zpe.sumelectthermalent: -1065.242881 hartree
zpe.sumelectthermalfe: -1065.313150 hartree
dipole: -1.9711 0.2485 0.2557
dipole: 2.0031
quadrupole: -126.5060 -127.6172 -135.7531
quadrupole: 15.0889 6.5957 2.5828
quadrupole: 3.4528 2.3416 -5.7943 15.0889 6.5957 2.5828
hfenergy: -1065.5560067 hartree
pointgroup: C01 [X(C15H16N2O5)]
dipole: -0.7757781 0.0915717 0.1041275 debye
polarizability: 211.6828237|4.5401098|175.5621858|-7.0209328|12.1283548|168.2660539 unknown
InChI: InChI=1S/C15H16N2O5/c1-2-8-15(10-6-4-3-5-7-10)12(20)16-14(22)17(13(15)21)9-11(18)19/h3-7,16,18H,2,8-9H2,1H3
charge 0 multiplicity 1
38 atoms
O  0.925464 0.143351 -1.765716
O  -1.177842 1.662754 2.249595
O  2.006166 -1.693743 2.370483
O  3.678287 0.531902 -0.053137
O  4.617638 -1.025717 -1.50578
N  1.394746 -0.852481 0.263859
N  0.346837 -0.067045 2.247516
C  -0.64054 0.643786 0.06391
C  -0.919929 2.021613 -0.619486
C  -1.860517 -0.308767 -0.202107
C  0.615739 0.000624 -0.554119
C  -0.514226 0.825088 1.58667
C  0.189906 3.079498 -0.427646
C  1.288419 -0.933929 1.673572
C  -3.016189 -0.229447 0.617916
C  -1.868369 -1.189183 -1.314479
C  -0.15813 4.393496 -1.15984
C  2.508969 -1.572592 -0.373174
C  -4.146128 -1.029648 0.340529
C  -3.001452 -1.987729 -1.586877
C  -4.143746 -1.916261 -0.759615
C  3.701991 -0.688191 -0.731912
H  -1.873218 2.40276 -0.210115
H  -1.06808 1.827105 -1.697122
H  1.150484 2.688033 -0.814501
H  0.325166 3.287271 0.651377
H  0.340543 -0.045517 3.27266
H  -3.042642 0.461946 1.466432
H  -1.005826 -1.243367 -1.985908
H  2.166583 -2.055252 -1.30131
H  2.854042 -2.346757 0.334068
H  -0.272158 4.223509 -2.246768
H  -1.106458 4.819381 -0.781997
H  0.632646 5.152273 -1.017609
H  -5.028794 -0.955903 0.985348
H  -2.989519 -2.661905 -2.450445
H  -5.020363 -2.53803 -0.971496
H  4.479099 1.066569 -0.304179
