program: Gaussian 09
title: 000214651
version: EM64L-G09RevD.01
frameworkgroup: C1[X(C10H5Br2NO3)]
method: RPBEPBE
basis: SDD
operation: Freq
keyword: #p
keyword: freq=noraman
keyword: PBEPBE/SDD
title: #p freq=noraman PBEPBE/SDD
converged: NO YES NO NO
title: Mulliken charges:
elementType: Br Br O O O N C C C C C C C C C C H H H H H
charge: 0.055659 0.054563 -0.291026 -0.220485 -0.236383 -0.624159 0.205335 0.372494 0.154160 -0.302423 -0.373776 0.238453 -0.382322 -0.250476 -0.149963 0.147822 0.303960 0.305156 0.279894 0.345985 0.367530
chargesum: 0.00000
title: Mulliken charges with hydrogens summed into heavy atoms:
elementType: Br Br O O O N C C C C C C C C C C
charge: 0.055659 0.054563 -0.291026 -0.220485 -0.236383 0.089356 0.205335 0.372494 0.154160 0.001537 -0.373776 0.238453 -0.077166 -0.250476 0.129931 0.147822
polarizability: 2.40927485e+02 -8.62159070e+00 1.95690884e+02 -7.41217652e-04 2.58321964e-03 5.47118773e+01
1716.lowfreq: -2.6432 -0.0007 -0.0005 -0.0004 5.5435 6.0881 36.6641 62.8600 88.9875
frequency: 36.6628 62.8594 88.9851 96.6160 114.7923 135.4472 169.1053 174.2360 190.1997 225.3574 261.2937 336.1403 349.8956 364.6819 422.0872 459.6880 485.0938 504.7422 523.2186 558.5500 573.7348 607.6926 625.3772 630.3563 679.4458 700.9278 745.6212 765.9598 780.3136 839.7995 884.5475 904.7992 920.1538 935.8449 1049.9105 1064.9732 1073.4470 1095.5678 1189.1296 1214.3143 1240.1737 1293.5411 1356.2012 1379.2886 1393.8860 1416.1802 1542.0036 1563.4556 1582.2523 1595.2987 1619.5602 1651.5835 3169.8932 3185.6167 3191.0946 3510.2352 3667.5555
redmass: 11.5100 6.4332 11.6365 11.7181 27.2808 8.2959 6.6253 8.6267 4.5686 21.9218 16.4165 8.3619 7.2950 5.6032 7.2251 4.7351 3.9873 11.1085 7.0494 4.1917 3.8693 1.1433 6.5986 1.3617 5.1509 7.5176 6.2238 5.2107 7.9180 6.8588 1.4287 6.3165 1.3995 1.4559 4.5591 2.3397 2.3181 2.6968 1.7984 3.5942 1.6205 3.4209 4.5638 8.7225 5.7629 3.6020 8.5189 10.1412 1.5537 8.1870 5.7716 4.3506 1.0929 1.0932 1.0926 1.0455 1.1048
irintensity: 0.9501 8.3082 2.9296 0.0085 0.2952 0.0337 9.0190 4.9744 0.0106 2.7152 0.6445 0.4864 8.5703 0.0179 25.2781 6.4311 0.6312 5.7371 5.9478 11.2206 9.2340 20.3246 8.2044 271.7163 6.2972 102.9167 12.9667 17.7653 1.3456 7.9656 18.4410 41.1673 35.4001 2.4450 13.5318 13.2908 42.5879 22.8003 17.9775 0.8953 19.0095 285.4688 115.4465 3.7567 21.5674 226.3059 141.2112 90.3017 130.3263 9.9376 259.3761 75.2099 6.8938 0.4833 6.7554 46.1248 78.0485
temp: 298.150 k
press: 1.00000 atm
elementType: 35 35 8 8 8 7 6 6 6 6 6 6 6 6 6 6 1 1 1 1 1
symmnumber: 1
zpe: 342128.3 jmol-1
zpe.correction: 0.130310 hartree
zpe.thermalcorrener: 0.144566 hartree
zpe.thermalcorrenthalpy: 0.145510 hartree
zpe.thermalcorrgfe: 0.086689 hartree
zpe.sumelectzpe: -690.297931 hartree
zpe.sumelectthermal: -690.283675 hartree
zpe.sumelectthermalent: -690.282731 hartree
zpe.sumelectthermalfe: -690.341552 hartree
dipole: 0.2133 5.4273 0.0008
dipole: 5.4315
quadrupole: -111.9812 -121.5118 -111.5111
quadrupole: -14.5563 -0.0038 0.0017
quadrupole: 3.0202 -6.5105 3.4903 -14.5563 -0.0038 0.0017
hfenergy: -690.4282409 hartree
pointgroup: C01 [X(C10H5Br2N1O3)]
dipole: 0.3434156 2.1091472 -0.000425 debye
dipolederiv: -0.07888 0.2003433 -0.0000751 0.1431504 -0.5790075 0.000229 -0.0000493 0.0002205 0.0126325 -0.7783806 0.1070258 -0.0000469 0.1456994 -0.0557794 0.000022 -0.0000598 0.0000206 -0.0003799 -1.3852085 -0.3810169 0.0001174 -0.1082304 -0.6346421 0.0001711 0.0000015 0.0001579 -0.1242023 -0.5174554 0.1575738 -0.0000508 -0.0654111 -1.1212535 0.0002826 0.0000164 0.0002544 -0.3335771 -1.0040915 -0.2326764 -0.0000398 -0.0399726 -0.6781052 -0.0000166 0.0001218 0.0002046 -0.3460051 -0.4519653 0.1730301 -0.0000747 0.1764237 -1.070595 0.0002036 -0.0001255 0.0001565 -0.6715352 -0.228815 -0.4353959 0.0001584 -0.3257352 -0.3674005 0.0001293 0.0001213 0.0001357 0.0065532 0.7978975 0.2343546 -0.0000814 -0.0043516 -0.1810442 0.0001216 -0.0000039 0.0001498 0.1454595 1.0088026 -0.1148167 0.0000245 0.2651977 1.3042765 -0.0003972 -0.0000573 -0.0003996 0.1853091 -0.4462001 0.1447244 -0.0000571 -0.0677801 -0.0095562 -0.0000142 0.0000166 -0.00001 -0.043614 -0.0241734 -0.3308367 0.0001334 -0.2402055 1.1284335 -0.0004938 0.0001002 -0.0004778 -0.1439948 0.4124449 0.4213366 -0.0001199 0.4799453 0.7315636 -0.0002265 -0.0002251 -0.0001935 0.1059965 -0.4985402 0.4344127 -0.0001267 0.0677564 -0.3578459 0.00008 -0.0000746 0.0001059 -0.1274351 1.468077 -0.2726424 0.0001143 -0.2979497 -0.0252476 -0.0000462 0.0001234 -0.0000473 -0.1442186 -0.3937863 0.1380753 -0.0000551 0.2084938 -0.1903832 0.0000744 -0.0000796 0.0000663 -0.0094247 1.3547317 -0.0751709 0.0001006 -0.2130616 1.4173218 -0.0001849 0.000109 -0.0003353 0.2376203 0.1317497 -0.0174804 0.0000051 0.0750517 0.0773817 0.0000308 -0.0000276 0.0000276 0.1573453 0.0767659 -0.0175641 0.0000054 -0.0359269 0.1196025 0.0000161 -0.0000043 0.0000215 0.165048 0.0714823 -0.0497297 0.000017 -0.0418068 0.0587364 0.0000355 0.0000143 0.0000371 0.1564432 0.202912 -0.0499886 0.0000236 -0.0283134 0.2113306 -0.0000068 0.0000644 -0.0000336 0.3875808 0.2826327 -0.0335581 0.0000279 -0.0929735 0.2222137 -0.0000099 0.000018 -0.0000613 0.3843984 unknown
polarizability: 238.171184|-13.8354722|198.4471677|0.004376|-0.048942|54.711894 unknown
InChI: InChI=1S/C10H5Br2NO3/c11-4-1-5-7(14)3-8(10(13)15)16-9(5)6(12)2-4/h1-3H,13H2
charge 0 multiplicity 1
21 atoms
Br 0.692623 3.423823 -0.001355
Br 4.996538 -0.4660 0.000141
O  -1.014889 0.858107 -0.0004
O  0.10239 -3.169493 0.000983
O  -4.367616 -0.463345 0.000179
N  -3.511261 1.715187 -0.000426
C  0.769043 -0.837328 0.000228
C  0.343948 0.516993 -0.00027
C  -0.239653 -1.945941 0.000614
C  2.155277 -1.132376 0.000354
C  1.291306 1.568723 -0.000645
C  -1.9722 -0.169736 -0.000047
C  -1.637997 -1.497711 0.000395
C  3.080303 -0.080465 -0.000017
C  2.66518 1.276679 -0.00052
C  -3.392506 0.343148 -0.000372
H  2.454187 -2.184616 0.000741
H  -2.444396 -2.23507 0.000603
H  3.399067 2.085976 -0.000808
H  -4.445707 2.121905 -0.000267
H  -2.686436 2.316339 -0.000408
