program: Gaussian 09
title: 000214649
version: EM64L-G09RevD.01
frameworkgroup: C1[X(C17H11NO3)]
method: RPBEPBE
basis: SDD
operation: Freq
keyword: #p
keyword: freq=noraman
keyword: PBEPBE/SDD
title: #p freq=noraman PBEPBE/SDD
converged: YES YES NO NO
title: Mulliken charges:
elementType: O O O N C C C C C C C C C C C C C C C C C H H H H H H H H H H H
charge: -0.246282 -0.253189 -0.236571 0.020386 0.191842 0.229715 0.378968 -0.513150 -0.469570 -0.365655 -0.354304 0.479774 0.148732 -0.385740 -0.386267 -0.399967 0.316522 -0.225202 -0.225182 -0.227371 -0.207651 0.293949 0.221282 0.221289 0.280269 0.261938 0.234979 0.234940 0.283317 0.232002 0.232001 0.234194
chargesum: 0.00000
title: Mulliken charges with hydrogens summed into heavy atoms:
elementType: O O O N C C C C C C C C C C C C C C C C C
charge: -0.246282 -0.253189 -0.236571 0.020386 0.191842 0.229715 0.378968 -0.219201 -0.026999 -0.085386 -0.092366 0.479774 0.148732 -0.150761 -0.151327 -0.116650 0.316522 0.006800 0.006819 0.006823 -0.207651
polarizability: 3.26165385e+02 4.82463592e+00 1.94910476e+02 5.02980058e-02 -5.46040120e-02 1.21227585e+02
1716.lowfreq: -11.3774 -0.0003 0.0006 0.0006 3.1274 3.4732 9.4610 28.0077 43.8139
frequency: -10.7612 27.9918 43.8129 60.8056 96.7843 111.6064 118.7486 143.4726 148.1722 210.9377 244.7739 266.1424 285.2467 342.0165 354.4791 381.6896 387.1037 402.8173 445.3937 460.2641 491.0194 503.9467 507.7418 590.0959 606.0042 612.2252 617.6390 645.4610 648.3998 663.0850 697.5611 709.0858 742.1055 751.7386 769.2233 832.2975 837.9535 853.0706 869.0144 875.0118 888.2791 902.6956 933.1796 970.8096 976.1392 977.7347 984.2256 991.2354 999.5509 1027.5251 1060.6395 1090.8161 1110.7834 1141.3169 1159.9503 1174.6916 1188.8446 1193.7040 1219.9003 1229.6360 1255.8679 1272.9817 1323.7600 1327.8351 1354.8728 1387.0886 1388.6129 1442.2880 1446.6049 1475.5166 1485.0624 1489.8395 1549.9887 1554.4366 1598.3249 1603.0124 1618.0096 1632.3066 2193.0138 2973.9708 3039.0957 3124.5801 3125.5561 3138.3154 3152.0619 3153.2781 3167.7567 3175.4594 3187.9766 3188.8858
redmass: 3.9133 6.4697 6.4092 5.1037 5.4728 8.5886 8.2518 7.8643 6.1320 5.7220 6.4368 7.7647 5.9277 2.4044 5.9628 8.1173 9.3368 2.7895 8.3486 3.3228 6.6235 7.2836 4.5401 6.1740 6.1950 6.8364 6.3406 8.9683 7.2760 2.7832 2.8923 2.1954 4.1970 3.0975 2.7573 1.4978 3.9350 1.2478 4.5971 1.5585 1.5800 5.7749 1.6748 1.5438 3.1818 1.3943 1.3670 6.0606 1.3345 2.1801 5.3771 1.5080 3.3800 2.1411 1.5037 1.0538 1.1179 1.0848 2.5291 2.4388 2.5019 1.7570 3.4117 1.2692 1.5047 5.1510 8.4776 2.1913 5.0687 1.2799 2.3605 2.4718 9.6342 9.7584 6.1271 8.2038 6.1965 7.4562 12.6243 1.0559 1.1082 1.0860 1.0887 1.0917 1.0962 1.0887 1.1016 1.0956 1.0932 1.0935
irintensity: 0.0028 0.1230 0.0942 0.2899 0.0242 0.9435 6.3465 5.9928 7.0325 0.0569 0.6198 2.3652 2.6247 0.3836 1.1847 2.1501 1.3986 0.0007 8.1057 4.0499 3.4934 3.5112 16.6145 15.4481 1.1544 21.4240 0.1147 0.2980 2.3708 6.5138 14.5955 48.5448 33.9728 1.4179 30.5281 35.2825 36.4448 0.0902 16.1574 38.6302 34.0217 64.8922 0.3767 4.0425 138.9647 0.0049 0.0841 0.9276 0.0084 5.6594 92.7708 7.1158 59.2716 184.7130 14.6316 0.0000 2.9373 1.5435 119.6084 12.1713 169.7577 95.3188 263.3022 0.2630 10.4611 175.6956 0.7900 9.7176 21.2900 37.1750 8.6654 21.6466 45.4785 98.3112 0.7476 221.6848 0.9398 391.8462 2.5284 33.9987 20.6384 6.2888 3.0730 12.4734 34.3639 0.3765 22.0678 12.6354 1.8447 1.0456
temp: 298.150 k
press: 1.00000 atm
elementType: 8 8 8 7 6 6 6 6 6 6 6 6 6 6 6 6 6 6 6 6 6 1 1 1 1 1 1 1 1 1 1 1
symmnumber: 1
zpe: 612505.7 jmol-1
zpe.correction: 0.233291 hartree
zpe.thermalcorrener: 0.249535 hartree
zpe.thermalcorrenthalpy: 0.250479 hartree
zpe.thermalcorrgfe: 0.188145 hartree
zpe.sumelectzpe: -933.356801 hartree
zpe.sumelectthermal: -933.340557 hartree
zpe.sumelectthermalent: -933.339613 hartree
zpe.sumelectthermalfe: -933.401947 hartree
dipole: 6.9970 -1.4306 -0.0019
dipole: 7.1417
quadrupole: -127.9036 -135.9546 -114.8956
quadrupole: 3.6030 0.0123 -0.0330
quadrupole: -1.6523 -9.7034 11.3557 3.6030 0.0123 -0.0330
hfenergy: -933.5900926 hartree
pointgroup: C01 [X(C17H11N1O3)]
dipole: -2.7621587 0.5150052 -0.0015666 debye
polarizability: 325.9584886|7.0962539|195.1158255|-0.218697|-0.3249735|121.2291318 unknown
InChI: InChI=1S/C17H11NO3/c18-10-14-8-16(19)15-7-6-13(9-17(15)21-14)20-11-12-4-2-1-3-5-12/h1-9H,11H2
charge 0 multiplicity 1
32 atoms
O  -1.699856 -0.041373 0.001633
O  2.890314 -1.271028 0.005353
O  4.226957 2.713049 -0.017406
N  5.816508 -3.049995 0.013906
C  2.365403 1.151231 -0.007659
C  1.951028 -0.21178 0.00008
C  -0.385588 0.418143 -0.001901
C  0.602504 -0.593576 0.003009
C  -2.796829 0.976012 -0.003539
C  1.349988 2.14122 -0.012498
C  -0.008756 1.79715 -0.009784
C  -4.110845 0.235704 0.001447
C  3.801979 1.511553 -0.010519
C  -4.733641 -0.128117 -1.218568
C  -4.735214 -0.109212 1.226128
C  4.719084 0.356289 -0.004596
C  4.250937 -0.936298 0.002809
C  -5.960481 -0.827726 -1.215772
C  -5.962121 -0.808714 1.232514
C  -6.577186 -1.168409 0.010685
C  5.094984 -2.097593 0.008861
H  0.314473 -1.647065 0.009025
H  -2.686994 1.612714 0.895995
H  -2.68792 1.602258 -0.910503
H  1.669583 3.188536 -0.018494
H  -0.765166 2.585973 -0.013687
H  -4.254593 0.132553 -2.170072
H  -4.2574 0.166128 2.174114
H  5.795236 0.545278 -0.006217
H  -6.434593 -1.104535 -2.163579
H  -6.437524 -1.070753 2.183871
H  -7.530272 -1.708816 0.01427
