program: Gaussian 09
title: 000214646
version: EM64L-G09RevD.01
frameworkgroup: C1[X(C10H6N2O5)]
method: RPBEPBE
basis: SDD
operation: Freq
keyword: #p
keyword: freq=noraman
keyword: PBEPBE/SDD
title: #p freq=noraman PBEPBE/SDD
converged: NO YES NO NO
title: Mulliken charges:
elementType: O O O O O N N C C C C C C C C C C H H H H H H
charge: -0.293857 -0.213816 -0.233767 -0.200026 -0.186074 0.023428 -0.618649 0.218007 0.221475 -0.487897 0.154679 0.396010 -0.329222 0.214560 -0.355178 -0.373404 0.156690 0.333049 0.269272 0.299186 0.306522 0.349449 0.349561
chargesum: 0.00000
title: Mulliken charges with hydrogens summed into heavy atoms:
elementType: O O O O O N N C C C C C C C C C C
charge: -0.293857 -0.213816 -0.233767 -0.200026 -0.186074 0.023428 0.080361 0.218007 0.221475 -0.154848 0.154679 0.396010 -0.059950 0.214560 -0.055992 -0.066882 0.156690
polarizability: 2.25090006e+02 -1.92778740e+00 1.65883878e+02 -2.83361250e-03 6.61212976e-04 5.26281818e+01
1716.lowfreq: -10.0649 -7.6678 -3.1638 -0.0004 0.0003 0.0006 44.0666 50.0204 62.9634
frequency: 44.0180 50.0182 62.9527 118.1202 133.7357 151.8753 178.0044 182.2071 265.0373 289.2241 317.1526 360.6802 425.5526 427.4450 476.4187 490.0457 503.9617 518.3496 519.7550 566.6620 580.6115 612.7853 622.5167 648.6651 654.2062 717.9927 734.2962 746.0649 773.9761 781.4839 847.7116 876.8472 894.1088 924.1650 978.4785 993.5932 1049.0963 1052.4898 1066.1006 1102.2530 1129.6557 1200.2333 1214.1491 1231.6237 1250.0756 1297.4435 1358.7779 1377.4531 1412.3199 1440.5200 1452.2587 1565.1121 1580.0093 1580.7097 1621.8921 1624.6887 1654.1247 3171.5557 3173.3810 3187.4666 3192.1603 3526.9134 3681.2249
redmass: 12.0716 10.5489 6.0354 8.2855 7.8742 7.2820 4.9706 7.8956 12.9832 9.5545 7.7107 4.8445 3.4932 8.9911 3.6582 9.1591 8.3667 3.9734 6.7111 4.1578 1.1274 5.9566 1.4173 6.5204 5.0724 5.5037 8.0954 6.9191 4.0370 7.0899 1.5161 5.6692 6.6084 1.4411 1.4390 1.3417 4.2421 2.2221 1.8722 3.6773 1.3114 3.8327 11.0032 1.9062 1.4645 3.9127 4.8296 11.9547 8.7614 6.2326 2.8879 8.9551 1.9950 3.6870 7.8761 5.4935 4.7428 1.0902 1.0922 1.0926 1.0970 1.0448 1.1049
irintensity: 1.9068 4.1627 1.6882 5.9592 0.0239 6.2693 6.5183 1.4955 1.9070 3.4282 0.0252 7.8352 0.1203 16.4603 8.6957 0.2807 9.5702 4.4810 4.6435 14.2711 94.2809 3.0401 192.3205 21.2556 14.0815 16.8170 25.6305 18.3144 1.8516 4.4625 49.2267 19.9844 30.1883 30.0479 17.1926 0.0028 8.0826 36.8775 38.4242 2.3679 55.9465 3.0939 417.6749 1.7761 10.2342 214.7175 125.6462 125.7591 30.0362 37.7128 27.5375 115.4802 38.4644 150.3162 53.5910 298.8408 66.3278 0.3420 13.3103 7.6784 3.5739 57.2804 62.8664
temp: 298.150 k
press: 1.00000 atm
elementType: 8 8 8 8 8 7 7 6 6 6 6 6 6 6 6 6 6 1 1 1 1 1 1
symmnumber: 1
zpe: 398729.7 jmol-1
zpe.correction: 0.151868 hartree
zpe.thermalcorrener: 0.165682 hartree
zpe.thermalcorrenthalpy: 0.166626 hartree
zpe.thermalcorrgfe: 0.110234 hartree
zpe.sumelectzpe: -869.024627 hartree
zpe.sumelectthermal: -869.010813 hartree
zpe.sumelectthermalent: -869.009869 hartree
zpe.sumelectthermalfe: -869.066261 hartree
dipole: -3.4457 -7.0692 -0.0001
dipole: 7.8643
quadrupole: -125.1786 -95.7069 -96.1546
quadrupole: 12.4580 0.0000 -0.0041
quadrupole: -19.4986 9.9732 9.5254 12.4580 0.0000 -0.0041
hfenergy: -869.176495 hartree
pointgroup: C01 [X(C10H6N2O5)]
dipole: -1.3050596 2.8053409 0.0011105 debye
dipolederiv: -1.6111502 -0.3530743 -0.0001006 -0.0804965 -0.652179 -0.0002004 0.0002334 -0.0001221 -0.142307 -0.5181062 0.1830781 0.0000879 -0.0552497 -1.0083396 -0.0003363 -0.0000121 -0.0002298 -0.3333332 -0.9882682 -0.2138452 0.0001224 -0.0378159 -0.7137988 0.0001244 -0.0003688 -0.000588 -0.3455853 -0.8273273 -0.2217215 -0.000096 -0.1805551 -0.6047999 -0.0001678 -0.0001056 -0.0002092 -0.2245278 -0.6986962 0.1561524 0.0000806 0.2260486 -0.6442622 -0.0002422 0.0000912 -0.0001861 -0.21236 1.9012184 0.0369192 0.0000056 -0.1473444 1.0320299 0.0004283 -0.0000789 0.000418 0.1899848 -0.4725741 0.2435675 0.0003471 0.22732 -1.1191181 -0.0003571 0.0004161 -0.000039 -0.6799461 -0.5062605 -0.2033224 -0.0000677 -0.0144693 -0.3951631 -0.0001648 -0.0000017 -0.0001669 -0.0233557 1.1527875 0.1021833 -0.0000021 -0.0727796 0.2222163 0.0000551 -0.0000845 -0.0000526 0.1374769 0.2803839 0.0663394 0.0000206 0.0947028 -0.0105159 0.0000265 0.0000541 0.0000125 -0.0474502 1.0521226 -0.2247623 -0.0001085 0.2377957 1.1971315 0.0004691 -0.0000108 0.0005042 0.1935596 -0.6635943 -0.0513185 -0.0000127 0.0229009 -0.1126661 -0.0000817 0.0000491 -0.0000758 0.0503206 -0.4779383 -0.1000517 -0.0000443 -0.2001616 0.0763755 0.0001235 -0.0000897 0.0000968 -0.1511351 0.4661462 0.4129331 0.0000659 0.499881 0.6945959 0.0002273 0.0002656 0.0000796 0.0995761 0.1800342 0.0075256 -0.0000072 -0.2316892 0.0634894 0.0000699 -0.0001168 0.0000748 -0.0940372 -0.5214558 0.4316826 0.0001179 0.0939767 -0.3230405 -0.0000828 0.0002171 -0.0001751 -0.1155511 1.3636658 -0.1610549 -0.0001562 -0.2421784 1.4896521 0.0001568 -0.0001375 0.0006178 0.2453292 0.1586589 -0.008742 0.0000008 0.0325936 0.1225366 -0.0000234 0.0000165 -0.0000253 0.1679662 0.0650298 0.0678773 0.0000332 0.0388072 0.0101057 -0.0000763 0.0000314 -0.0000773 0.1729349 0.1094771 -0.0629323 -0.0000239 -0.0173478 0.095667 -0.0000322 -0.0000048 -0.0000299 0.1721471 0.0864631 -0.016917 0.0000057 -0.0403581 0.1242098 -0.0000123 0.0000326 -0.0000419 0.1625014 0.210325 -0.0530933 -0.0000967 -0.0303125 0.2138497 0.000043 -0.0001635 0.0000569 0.3902068 0.259059 -0.0374232 -0.0001719 -0.1232682 0.2420239 0.0000532 -0.0002326 0.0001584 0.3875853 unknown
polarizability: 225.1403876|0.8549425|165.8334788|0.0053298|0.044252|52.6281992 unknown
InChI: InChI=1S/C10H6N2O5/c11-10(14)9-4-7(13)6-3-5(12(15)16)1-2-8(6)17-9/h1-4H,11H2
charge 0 multiplicity 1
23 atoms
O  -1.574367 1.055545 0.000552
O  -0.328482 -2.939654 -0.001097
O  -4.876861 -0.402726 -0.000806
O  4.771895 1.071088 0.000458
O  4.40884 -1.18173 -0.000634
N  3.996973 0.03835 -0.000116
N  -4.124691 1.809694 0.000304
C  0.260794 -0.587478 -0.000269
C  -0.20126 0.756166 0.000341
C  1.656799 -0.818999 -0.000415
C  -0.70692 -1.727693 -0.000794
C  2.529176 0.278735 0.000011
C  0.682557 1.858678 0.000803
C  -2.497893 -0.008234 0.000249
C  2.063347 1.619144 0.000654
C  -2.119885 -1.323443 -0.000342
C  -3.938281 0.444752 0.000678
H  2.029363 -1.84798 -0.000905
H  0.280336 2.875039 0.001282
H  2.788489 2.436599 0.000996
H  -2.903576 -2.085422 -0.000481
H  -5.077914 2.169095 -0.000383
H  -3.334337 2.452776 0.000614
