program: Gaussian 09
title: 000214636
version: EM64L-G09RevD.01
frameworkgroup: C1[X(C11H8N4O3)]
method: RPBEPBE
basis: SDD
operation: Freq
keyword: #p
keyword: freq=noraman
keyword: PBEPBE/SDD
title: #p freq=noraman PBEPBE/SDD
converged: YES YES NO NO
title: Mulliken charges:
elementType: O O O N N N N C C C C C C C C C C C H H H H H H H H
charge: -0.244348 -0.270722 -0.259271 -0.009988 -0.086859 -0.362734 0.006438 0.061374 0.190129 0.238392 0.187741 0.325845 -0.388810 -0.417760 -0.378930 -0.184272 -0.046210 -0.522865 0.275590 0.285963 0.262409 0.240735 0.292998 0.208700 0.229833 0.366622
chargesum: 0.00000
title: Mulliken charges with hydrogens summed into heavy atoms:
elementType: O O O N N N N C C C C C C C C C C C
charge: -0.244348 -0.270722 -0.259271 -0.009988 -0.086859 0.003888 0.006438 0.061374 0.190129 0.238392 0.187741 0.325845 -0.113219 -0.131797 -0.116521 0.056462 -0.046210 0.208667
polarizability: 2.49103578e+02 -3.14909694e+00 1.81404165e+02 -1.70036510e+00 3.08959215e+00 6.86988501e+01
1716.lowfreq: -6.4324 -4.4231 -0.0006 -0.0002 -0.0001 5.1319 37.4860 41.5508 76.6295
frequency: 37.4795 41.5463 76.6241 94.8272 106.6147 122.4767 150.4364 215.3562 221.9836 242.8443 271.4211 292.7505 329.8871 360.2587 438.9317 443.6395 487.8719 494.2148 558.9610 583.4121 588.4820 613.2902 625.4026 642.9534 665.9976 734.2148 747.1994 763.7074 778.1923 808.2024 864.5890 888.2374 890.2082 894.6348 896.7052 951.1140 980.4559 984.8470 1007.6983 1045.5511 1073.5802 1105.6155 1109.8016 1111.2304 1149.9664 1161.5808 1169.7420 1207.4697 1212.7867 1242.4858 1262.5181 1321.7778 1380.0371 1400.1494 1408.9701 1414.9397 1444.7687 1459.0896 1460.4837 1482.9528 1546.8469 1573.6781 1604.1043 1639.5425 2983.6898 3097.1496 3130.3118 3151.6080 3176.2057 3187.1245 3191.1711 3600.4326
redmass: 9.6539 5.1036 3.1572 5.4343 3.2456 1.8137 4.5947 4.9364 7.8070 4.5516 6.1218 5.3817 6.9266 8.4174 5.4586 7.1490 4.5471 8.0042 7.4055 7.1848 7.9143 5.6011 6.2869 10.6885 3.1706 1.3984 3.0604 2.9228 4.3830 2.0469 8.1060 1.5623 6.5934 4.8865 1.5847 10.5108 1.3293 8.7134 7.1217 5.2575 2.6168 1.8111 6.0607 1.3139 1.3371 6.6706 1.1707 4.6729 3.4310 3.1547 2.1030 4.7900 8.4582 1.5548 2.1479 1.8178 1.1619 2.4110 3.9382 1.0778 6.6225 8.1226 7.4949 8.6527 1.0320 1.1000 1.1054 1.0879 1.0928 1.0988 1.0931 1.0849
irintensity: 4.4192 1.8053 2.7738 1.2535 3.1164 0.6484 8.1823 2.3887 1.0029 4.4547 3.2264 1.2532 4.1639 5.6453 6.7321 3.2402 7.9215 2.5978 7.5837 4.7169 1.6890 1.5866 8.0199 4.3953 4.5333 85.2444 61.7657 5.2028 3.6816 62.5361 15.6292 33.3542 4.4961 20.6924 10.6303 1.2832 2.2203 39.0082 58.2303 15.0113 35.3508 11.2043 12.0651 24.8764 5.9207 10.3485 2.2026 3.8524 10.0876 109.3822 12.9575 208.4927 56.5593 20.5096 5.6390 22.9371 69.0715 59.4926 44.2608 69.9463 99.1272 187.4254 76.3918 124.2865 63.9658 34.8711 9.3089 8.9466 4.0227 3.7513 2.6606 155.3352
temp: 298.150 k
press: 1.00000 atm
elementType: 8 8 8 7 7 7 7 6 6 6 6 6 6 6 6 6 6 6 1 1 1 1 1 1 1 1
symmnumber: 1
zpe: 474947.6 jmol-1
zpe.correction: 0.180898 hartree
zpe.thermalcorrener: 0.195510 hartree
zpe.thermalcorrenthalpy: 0.196454 hartree
zpe.thermalcorrgfe: 0.137953 hartree
zpe.sumelectzpe: -867.300964 hartree
zpe.sumelectthermal: -867.286352 hartree
zpe.sumelectthermalent: -867.285407 hartree
zpe.sumelectthermalfe: -867.343908 hartree
dipole: -1.8915 -0.1045 1.7644
dipole: 2.5888
quadrupole: -82.6755 -103.8143 -104.0944
quadrupole: 19.8219 7.0183 -5.9584
quadrupole: 14.1859 -6.9529 -7.2330 19.8219 7.0183 -5.9584
hfenergy: -867.4818615 hartree
pointgroup: C01 [X(C11H8N4O3)]
dipole: 0.7383634 -0.0012489 -0.7015606 debye
dipolederiv: -1.1077674 0.4197967 0.0216945 0.2579036 -0.7373104 0.0154468 0.0784008 -0.0149473 -0.1369663 -0.7728105 -0.4741921 -0.1836924 -0.7141149 -1.0669017 -0.2825178 -0.0107487 -0.0936629 -0.3638771 -0.6808371 -0.2638524 0.0423387 -0.1634385 -0.9819172 0.1034053 -0.0175689 0.1112657 -0.3850926 0.0835322 -0.2261467 -0.0005126 0.1327314 -0.3005617 0.0030431 -0.0170277 0.023924 -0.0849192 -0.2413736 0.2057396 -0.0036677 -0.078847 -0.1104438 0.0032466 0.0149802 -0.0144586 -0.1326462 -0.6255411 0.2382983 0.0128298 -0.0042766 -0.0780958 -0.0042597 0.03109 -0.0199604 -0.1648813 -0.2466921 -0.2231689 0.017225 -0.0597597 0.2424927 -0.009755 0.0130494 0.0011982 -0.0966388 -0.4481955 0.011623 -0.0489234 0.3813988 -0.6438649 0.0331987 0.0670042 0.0402155 -0.077351 0.8044988 -0.1694212 -0.037322 -0.5188778 0.4578679 0.0083438 -0.0704176 0.0258204 0.1299724 0.8119086 0.4242781 0.2307914 0.7132546 0.8457442 0.1500316 0.0312128 0.0013037 0.0913581 1.3367944 0.2391862 -0.1027035 -0.2297685 1.1245539 -0.1657739 -0.0574044 -0.158923 0.2298461 0.7228296 -0.1475586 -0.0286264 -0.2490584 0.88878 -0.0263433 -0.0695807 -0.0305696 0.1565875 -0.4318116 0.0938233 -0.0314097 0.3613255 -0.1574208 -0.0049261 0.0076741 0.0003073 -0.200971 -0.8359515 -0.349837 0.0565279 -0.0542522 -0.2244587 0.0001411 0.0422417 0.030705 -0.1864067 0.0066697 0.0343126 -0.0239679 -0.3286559 -0.4868173 -0.0737484 -0.1147543 -0.0821747 -0.2078024 0.3729474 0.0774262 0.0145908 0.0860894 0.2411385 0.0300914 -0.0058115 0.0369207 -0.1135301 0.523219 0.0875272 -0.0274262 0.1833807 -0.0093482 -0.0062126 -0.0470689 -0.0045587 0.0689127 0.1749673 -0.0131409 -0.0095145 0.2885614 0.5736675 0.2222146 0.1610342 0.2384314 0.39312 0.0468013 -0.0769346 0.0053953 -0.0440807 0.0483191 -0.0035613 0.0145553 -0.0067544 0.187296 0.0678154 0.0311818 0.0058442 0.0877353 0.072736 0.0026298 0.0263933 0.0227777 0.1608238 -0.0542667 0.0240764 0.0000486 0.0079176 0.0960828 -0.0014333 -0.0228842 -0.0149764 0.1683381 0.0637438 0.0734442 0.0062096 0.0745472 -0.0703996 -0.018324 0.0221299 -0.0105192 0.1549637 0.1833759 0.1420052 0.0181472 0.0500578 0.0076639 -0.0014788 -0.000851 0.038951 0.0742807 0.0523522 -0.0040146 0.1322605 -0.0756462 -0.0106269 0.0584444 0.0150179 -0.0439501 -0.1127721 -0.1615687 -0.1108418 -0.0709436 -0.0329988 0.0615566 -0.0426184 -0.0950535 -0.0859587 0.0719078 0.3553602 -0.0436098 0.0048063 -0.0711281 0.2175639 0.0107153 0.0043876 0.0095936 0.376448 unknown
polarizability: 249.0497436|3.4231152|181.4195892|-3.0382238|3.062099|68.7372606 unknown
InChI: InChI=1S/C11H8N4O3/c1-17-7-3-2-4-8-10(7)6(16)5-9(18-8)11-12-14-15-13-11/h2-5,14H,1H3
charge 0 multiplicity 1
26 atoms
O  0.676152 1.065715 -0.007244
O  -3.972488 -0.784777 -0.035137
O  -1.499209 -2.457844 0.474091
N  3.552647 -1.205725 -0.117779
N  3.470307 1.099658 -0.212872
N  4.782977 -0.631456 -0.224445
N  4.778426 0.760759 -0.285451
C  -1.557444 -0.040382 0.057342
C  -0.735453 1.135982 0.055332
C  -2.98228 0.187314 0.049992
C  -0.891176 -1.365147 0.210996
C  1.286766 -0.181213 -0.011223
C  -1.23667 2.446649 0.130754
C  0.573371 -1.347837 0.094852
C  -3.492757 1.503348 0.164518
C  -2.631922 2.617962 0.215166
C  2.743699 -0.094863 -0.112123
C  -3.861479 -1.918418 -0.979029
H  -0.537879 3.286449 0.130085
H  1.097627 -2.305259 0.131609
H  -4.579682 1.621385 0.180731
H  -3.053034 3.625546 0.289343
H  -3.327514 -2.751727 -0.499613
H  -3.32987 -1.606886 -1.897819
H  -4.904131 -2.182287 -1.215629
H  5.644615 -1.176646 -0.256845
