program: Gaussian 09
title: 000214632
version: EM64L-G09RevD.01
frameworkgroup: C1[X(C11H9NO3)]
method: RPBEPBE
basis: SDD
operation: Freq
keyword: #p
keyword: freq=noraman
keyword: PBEPBE/SDD
title: #p freq=noraman PBEPBE/SDD
converged: YES YES NO NO
title: Mulliken charges:
elementType: O O O N C C C C C C C C C C C H H H H H H H H H
charge: -0.312840 -0.234408 -0.249120 -0.621996 0.187517 0.183612 0.219971 0.047888 0.092893 -0.346922 -0.353540 -0.771482 -0.245106 -0.204705 0.142175 0.283502 0.256613 0.263490 0.247943 0.247779 0.239481 0.238899 0.338891 0.349466
chargesum: 0.00000
title: Mulliken charges with hydrogens summed into heavy atoms:
elementType: O O O N C C C C C C C C C C C
charge: -0.312840 -0.234408 -0.249120 0.066360 0.187517 0.183612 0.219971 0.047888 0.092893 -0.063420 -0.096927 -0.012270 -0.005625 0.034194 0.142175
polarizability: 1.90066786e+02 6.28374884e+00 1.64837526e+02 7.38324632e-03 9.86240620e-03 5.69894340e+01
1716.lowfreq: -3.9470 -0.0008 -0.0003 0.0006 10.8228 12.8355 47.7656 80.2979 88.0412
frequency: 47.6715 80.2379 88.0389 131.3750 141.5460 173.7051 258.1319 273.9158 318.4112 321.7135 346.2312 386.1650 421.7461 429.1858 485.3766 497.4216 525.7394 564.7235 583.5470 604.6026 608.5061 648.0959 673.3215 689.7482 754.5312 767.7393 794.3696 824.8819 845.7983 882.6676 973.5164 975.5634 1003.8224 1025.4506 1038.9827 1049.5889 1064.5263 1101.1969 1111.4694 1164.3401 1190.8462 1211.7386 1266.2174 1311.8349 1367.1891 1396.8636 1404.9069 1446.3677 1451.0245 1463.7153 1466.3162 1548.9854 1566.4625 1573.8883 1599.0423 1620.8198 1634.3611 3002.2544 3085.8618 3113.0583 3141.5037 3154.1908 3166.4092 3176.6969 3525.8908 3683.0897
redmass: 5.1572 5.4118 4.2677 1.0730 5.4751 5.4061 5.5007 4.6220 4.6336 6.4532 4.1977 5.5698 3.5298 5.3424 3.0540 7.8199 3.7364 5.1779 1.1333 1.4028 5.9492 5.5533 6.6813 3.9748 8.8243 1.7782 2.3915 5.0379 5.0649 1.4669 1.3651 4.3972 1.3317 2.0334 1.4859 2.3100 1.9259 2.0226 5.0733 1.1615 2.2706 3.1466 1.8770 2.9754 5.2974 1.1973 10.5067 1.4400 1.8863 2.3703 1.0461 9.3971 1.6781 5.8542 6.7227 6.7198 3.7509 1.0356 1.0961 1.1018 1.0862 1.0898 1.0954 1.1007 1.0443 1.1051
irintensity: 4.0549 2.5806 6.3133 1.7550 0.0965 3.6653 0.1392 4.4601 0.0104 1.0618 1.5731 18.1450 0.1628 13.8756 19.9152 1.8424 5.8197 2.2595 181.9213 84.3814 6.0455 14.1428 13.2045 25.0055 18.0327 81.2266 15.4168 7.6071 7.0237 0.3196 3.0583 19.7458 0.1810 0.8983 3.0806 7.1196 21.7585 36.8722 65.7268 1.4286 20.0560 22.0588 37.6713 196.7643 89.9063 54.4505 13.6914 27.5406 93.3286 4.0745 14.9488 182.0280 136.3872 5.7051 112.6887 54.0632 146.1138 7.5006 7.2015 6.7677 3.3203 4.6556 7.0160 18.2845 48.5848 58.2123
temp: 298.150 k
press: 1.00000 atm
elementType: 8 8 8 7 6 6 6 6 6 6 6 6 6 6 6 1 1 1 1 1 1 1 1 1
symmnumber: 1
zpe: 468021.8 jmol-1
zpe.correction: 0.178260 hartree
zpe.thermalcorrener: 0.190976 hartree
zpe.thermalcorrenthalpy: 0.191920 hartree
zpe.thermalcorrgfe: 0.139003 hartree
zpe.sumelectzpe: -703.956330 hartree
zpe.sumelectthermal: -703.943614 hartree
zpe.sumelectthermalent: -703.942670 hartree
zpe.sumelectthermalfe: -703.995587 hartree
dipole: -2.6828 -5.6005 -0.0007
dipole: 6.2099
quadrupole: -83.5937 -81.6088 -88.9546
quadrupole: -1.6842 -0.0059 0.0054
quadrupole: 1.1254 3.1102 -4.2356 -1.6842 -0.0059 0.0054
hfenergy: -704.1345904 hartree
pointgroup: C01 [X(C11H9N1O3)]
dipole: 1.0945335 -2.1842673 0.0053975 debye
dipolederiv: -1.377192 0.3385606 -0.0015948 0.0162658 -0.7050323 0.001088 -0.0007849 0.0014479 -0.1472454 -0.5619008 -0.1714949 0.0001332 0.0212911 -1.0966556 0.001414 -0.0001102 0.0013045 -0.3381383 -0.9891779 0.1557236 -0.0010647 0.000333 -0.6720469 0.000901 -0.000734 0.0009186 -0.3327618 -0.3805228 -0.1249825 0.0006358 -0.123182 -1.2278983 0.0013188 0.0006959 0.0013302 -0.6835855 -0.3705339 0.3025366 -0.0007707 0.1476908 -0.3616385 0.0007381 -0.0005938 0.0008043 -0.0192183 -0.2757911 -0.6359591 0.0012627 -0.2478548 -0.1238352 -0.0002772 0.0007242 -0.000821 -0.031659 0.9616387 -0.0551775 0.0007242 0.0425674 0.1696038 -0.0000229 0.0004304 -0.0001462 0.1224888 0.987903 0.2688075 0.0000816 -0.110023 1.1839966 -0.0019825 0.0007903 -0.0017128 0.176084 0.3317607 -0.5354629 0.0013079 -0.3789329 0.4320802 -0.0007996 0.00082 -0.0010692 0.0633156 0.0425275 -0.1263111 0.0003129 0.1110688 0.0884136 -0.0002905 -0.0001079 -0.0004418 -0.0999045 -0.3424743 0.0048471 -0.0001444 0.0932472 0.0672881 -0.0003969 -0.0002382 -0.000459 -0.1772193 -0.1730994 0.2515471 -0.0006858 0.0545276 -0.0092769 0.0003435 -0.0005196 0.0012558 0.0169997 0.0887054 0.142382 -0.000092 0.1064449 -0.2170994 0.0001564 -0.0000209 0.0001962 -0.1651115 0.0928898 0.0132506 0.0001365 -0.048706 0.188013 -0.0006282 0.0002308 -0.0005982 -0.1317555 1.2432949 0.1997082 0.0006015 0.2125941 1.6334854 -0.0033731 0.0004667 -0.0033337 0.2310816 0.1152682 0.0147011 -0.0000578 -0.0663115 0.0153637 0.0002246 0.000092 0.0002807 0.1554506 0.0821985 -0.0744143 0.0000811 -0.028216 -0.0322239 0.0003799 -0.000014 0.0003553 0.178146 0.1390035 -0.1443893 -0.0001345 0.0054627 -0.0297093 -0.0002956 -0.0001662 -0.0004836 0.1144207 0.0445993 0.0124887 0.0794232 0.0001918 0.0718315 0.041147 0.0847533 0.0098098 -0.0088634 0.0453831 0.0126626 -0.0791496 0.0007291 0.0714259 -0.0409574 -0.0845513 -0.009838 -0.010343 -0.1055189 -0.0388099 -0.0001121 -0.0448704 0.0774497 0.0001358 -0.0000992 0.0001463 0.1656045 -0.0148199 0.1019271 -0.0003119 0.1028456 -0.0014108 0.0003748 -0.0003151 0.0003685 0.1577265 0.1758242 0.0393923 -0.0003226 0.0228216 0.2188937 0.0004143 -0.0002959 0.0004059 0.3827136 0.2400343 0.0484663 -0.00026 0.1100151 0.2589817 0.0003876 -0.0004523 0.0002798 0.3817736 unknown
polarizability: 190.2823298|-5.8306349|164.62142|0.1157974|-0.2280689|56.9899965 unknown
InChI: InChI=1S/C11H9NO3/c1-6-9(13)7-4-2-3-5-8(7)15-10(6)11(12)14/h2-5H,12H2,1H3
charge 0 multiplicity 1
24 atoms
O  -0.367964 -1.225252 -0.000991
O  0.491131 2.849838 -0.008181
O  -3.839712 -0.273279 -0.0061
N  -2.722087 -2.315922 0.000062
C  1.296118 0.576124 -0.003341
C  -1.178982 1.097438 -0.006068
C  0.971083 -0.802524 -0.000917
C  0.225068 1.603223 -0.006032
C  -1.406099 -0.266058 -0.003594
C  2.669586 0.941305 -0.00309
C  1.959746 -1.810205 0.001678
C  -2.280764 2.129612 -0.009103
C  3.669268 -0.044484 -0.000523
C  3.311747 -1.422128 0.001868
C  -2.757432 -0.935222 -0.00337
H  2.907097 2.009995 -0.004978
H  1.662587 -2.862955 0.003476
H  -1.819558 3.130187 -0.006986
H  -2.941218 2.018341 0.867547
H  -2.934745 2.019748 -0.89082
H  4.725466 0.242889 -0.000355
H  4.093108 -2.189402 0.003857
H  -3.608149 -2.818389 0.000302
H  -1.837295 -2.820681 0.002156
