program: Gaussian 09
title: 000012392
version: EM64L-G09RevD.01
frameworkgroup: C1[X(C14H30O)]
method: RPBEPBE
basis: SDD
operation: Freq
keyword: #pfreq=noraman
keyword: PBEPBE/SDD
title: #p freq=noraman PBEPBE/SDD
converged: YES YES NO NO
title: Mulliken charges:
elementType: O C C C C C C C C C C C C C C H H H H H H H H H H H H H H H H H H H H H H H H H H H H H H
charge: -0.269975 -0.371785 -0.371786 -0.367868 -0.367867 -0.396953 -0.396952 -0.351666 -0.351666 -0.258250 -0.258250 -0.355758 -0.355758 -0.696124 -0.696124 0.187246 0.187296 0.187246 0.187296 0.191178 0.191090 0.191179 0.191089 0.209337 0.209350 0.209337 0.209350 0.187147 0.187013 0.187146 0.187013 0.179217 0.179332 0.179219 0.179333 0.195329 0.195390 0.195329 0.195390 0.209522 0.215388 0.209555 0.209522 0.215388 0.209555
chargesum: 0.00000
title: Mulliken charges with hydrogens summed into heavy atoms:
elementType: O C C C C C C C C C C C C C C
charge: -0.269975 0.002757 0.002757 0.014401 0.014401 0.021734 0.021735 0.022494 0.022494 0.100300 0.100301 0.034961 0.034961 -0.061660 -0.061659
polarizability: 2.17310049e+02 1.22344317e-05 1.35634977e+02 1.55520679e-02 -2.25925419e-05 1.28069750e+02
1716.lowfreq: -0.0012 0.0014 0.0014 6.0658 6.4817 17.6186 26.2885 34.1357 38.1136
frequency: 17.8258 26.2885 38.1090 46.0337 63.8451 65.2393 71.2541 92.5579 103.5202 115.7758 122.4802 131.2916 140.2649 149.3194 153.8464 158.2815 183.0347 226.4256 226.4309 257.1286 280.2797 340.5671 394.1843 419.5473 458.8531 507.5233 511.8633 723.0557 723.1188 735.6407 735.9562 771.0013 774.1104 831.2530 837.1853 887.1663 888.7155 913.9166 914.0793 919.7263 990.2684 999.4480 1002.7948 1003.8847 1029.0690 1039.0610 1040.0731 1062.1830 1068.7363 1079.5054 1080.1917 1083.7995 1092.6683 1120.2457 1132.1289 1139.9315 1162.1420 1189.2157 1192.4162 1222.9903 1229.2925 1231.0085 1233.7523 1266.8658 1270.8295 1272.4683 1277.9435 1278.4823 1279.0546 1290.4926 1290.9253 1295.7264 1295.9308 1317.5012 1323.7111 1347.6441 1353.4263 1356.9255 1357.7344 1362.5448 1387.6965 1387.7034 1409.9490 1462.6775 1463.0769 1464.7717 1465.0626 1467.4496 1469.9959 1472.2348 1475.3311 1475.9381 1475.9399 1478.6974 1482.6682 1485.8822 1488.4572 1489.7273 1495.3693 2894.2973 2905.9187 2943.8564 2945.0030 2950.9914 2951.0624 2951.6964 2951.8684 2959.6526 2959.7470 2968.4349 2968.5016 2970.9318 2970.9641 2985.6644 2985.7146 2989.0729 2989.7297 2995.3450 2995.3880 3014.5415 3014.5686 3033.9539 3034.0009 3055.1099 3055.8771 3067.3830 3067.4217 3070.2441 3070.2645
redmass: 3.8392 4.0946 2.7801 1.6814 3.6764 2.8239 1.8184 1.7285 2.4205 3.6408 2.0487 2.3193 1.7555 2.2367 4.3125 2.4332 3.3368 1.1266 1.1263 3.2484 4.1526 3.1757 3.2341 3.3270 2.9632 2.9661 3.7741 1.0635 1.0635 1.0874 1.0887 1.1234 1.1300 1.1776 1.1811 2.0520 1.8726 5.1387 1.1960 1.1880 5.1838 1.1249 1.1148 4.3560 3.1753 3.0697 4.5134 2.8774 4.1165 2.1979 2.1172 2.5076 2.1855 2.6541 3.1554 1.3486 1.5956 1.6424 1.5613 1.2738 1.3082 1.3527 1.3464 1.1639 1.1731 1.2840 1.3158 1.0937 1.0821 1.0882 1.0885 1.1073 1.1098 1.3095 1.3899 1.3945 1.5537 1.6522 1.6836 1.5796 1.2179 1.2179 1.4959 1.0742 1.0720 1.0721 1.0737 1.0751 1.0714 1.0765 1.0753 1.0426 1.0426 1.0786 1.0817 1.0848 1.0890 1.0952 1.0857 1.0546 1.0544 1.1046 1.1063 1.0590 1.0590 1.0589 1.0589 1.0592 1.0591 1.0584 1.0584 1.0369 1.0369 1.0971 1.0971 1.0591 1.0592 1.1003 1.1003 1.1033 1.1033 1.1045 1.1045 1.1044 1.1042 1.1007 1.1007 1.0993 1.0993
irintensity: 0.1111 0.0234 0.0000 0.0000 0.1827 2.1388 0.6674 0.0000 0.0000 0.0139 3.0703 0.2273 0.0000 0.0000 0.0049 3.5713 0.6511 0.0005 0.0052 0.6566 0.0012 2.0937 0.0409 0.1789 0.0041 0.7527 11.2218 0.0012 26.1899 0.0000 0.1612 0.0000 6.2027 0.0000 0.6210 7.8160 4.5690 7.2293 0.0323 0.8987 9.4644 0.0000 0.9251 0.2735 3.4400 3.6426 52.0684 0.0060 124.5944 0.0004 0.0607 37.5845 3.5318 10.3435 0.3920 0.0000 3.1033 0.0000 2.5401 14.3533 0.7555 0.0001 0.2369 0.0000 0.3033 0.0291 0.0595 0.0000 0.0002 0.0000 0.8433 0.0000 0.5537 5.6450 0.1491 12.1980 0.5225 7.1105 0.0766 29.9600 7.7963 13.4731 0.0908 0.3194 0.0660 0.0757 0.0029 2.9954 0.6494 0.0181 0.6505 0.2146 24.5281 9.1354 1.3882 0.0028 36.8852 1.5745 13.0040 24.9819 104.7667 107.1148 0.0012 0.3633 0.5566 0.2882 11.8316 0.0108 51.9276 7.8700 225.7817 62.7674 7.3356 0.0026 2.1849 0.5936 92.9154 0.0007 2.0656 0.0001 0.5337 0.0153 108.5898 0.0037 187.8756 0.1470 214.4692 36.6557 73.4132
temp: 298.150 k
press: 1.00000 atm
elementType: 8 6 6 6 6 6 6 6 6 6 6 6 6 6 6 1 1 1 1 1 1 1 1 1 1 1 1 1 1 1 1 1 1 1 1 1 1 1 1 1 1 1 1 1 1
symmnumber: 1
zpe: 1083431.1 jmol-1
zpe.correction: 0.412657 hartree
zpe.thermalcorrener: 0.433589 hartree
zpe.thermalcorrenthalpy: 0.434534 hartree
zpe.thermalcorrgfe: 0.359627 hartree
zpe.sumelectzpe: -625.417057 hartree
zpe.sumelectthermal: -625.396124 hartree
zpe.sumelectthermalent: -625.395180 hartree
zpe.sumelectthermalfe: -625.470087 hartree
dipole: 0.0000 -1.3326 0.0000
dipole: 1.3326
quadrupole: -95.9835 -98.8178 -96.3160
quadrupole: 0.0000 -0.0071 0.0000
quadrupole: 1.0556 -1.7787 0.7231 0.0000 -0.0071 0.0000
hfenergy: -625.8297139 hartree
pointgroup: C01 [X(C14H30O1)]
dipole: -0.0000055 -0.5242727 -0.0000061 debye
polarizability: 217.3099291|-0.0001209|135.6349769|-0.1043916|0.0000138|128.0698693 unknown
InChI: InChI=1S/C14H30O/c1-3-5-7-9-11-13-15-14-12-10-8-6-4-2/h3-14H2,1-2H3
charge 0 multiplicity 1
45 atoms
O  0.000007 0.135145 0.000009
C  3.772861 -0.482345 -0.005927
C  -3.77285 -0.482339 0.005932
C  4.991699 0.46767 -0.008219
C  -4.991684 0.467681 0.008235
C  2.42273 0.270117 -0.004438
C  -2.422716 0.270119 0.004465
C  6.34594 -0.276472 -0.009787
C  -6.345927 -0.276455 0.009801
C  1.220771 -0.679084 -0.001079
C  -1.22076 -0.679085 0.00108
C  7.565309 0.673602 -0.010025
C  -7.565295 0.673624 0.01001
C  8.915115 -0.076211 -0.010005
C  -8.915102 -0.076185 0.010048
H  3.82995 -1.145746 0.882778
H  3.827301 -1.146715 -0.894064
H  -3.829936 -1.145721 -0.882787
H  -3.827298 -1.146724 0.894057
H  4.936626 1.13136 -0.896302
H  4.939327 1.132434 0.87925
H  -4.936606 1.131365 0.896322
H  -4.93931 1.132454 -0.879229
H  2.356027 0.928514 0.883358
H  2.35274 0.92621 -0.89368
H  -2.356012 0.92854 -0.883312
H  -2.352724 0.926186 0.893725
H  6.400036 -0.940239 -0.898307
H  6.401358 -0.941603 0.877671
H  -6.400037 -0.940207 0.898331
H  -6.401339 -0.9416 -0.877648
H  1.237789 -1.338081 -0.900417
H  1.240859 -1.335655 0.899978
H  -1.237774 -1.338104 0.9004
H  -1.240847 -1.335631 -0.899996
H  7.509361 1.337384 0.877027
H  7.509343 1.337111 -0.897272
H  -7.509357 1.33736 -0.877077
H  -7.509312 1.337176 0.897223
H  9.008373 -0.723903 0.882335
H  9.769462 0.625592 -0.008878
H  9.009471 -0.722356 -0.903337
H  -9.008379 -0.723917 -0.882261
H  -9.769446 0.625621 0.008901
H  -9.009445 -0.722287 0.903412
