program: Gaussian 09
title: 000214627
version: EM64L-G09RevD.01
frameworkgroup: C1[X(C11H8N4O2)]
method: RPBEPBE
basis: SDD
operation: Freq
keyword: #p
keyword: freq=noraman
keyword: PBEPBE/SDD
title: #p freq=noraman PBEPBE/SDD
converged: NO NO NO NO
title: Mulliken charges:
elementType: O O N N N N C C C C C C C C C C C H H H H H H H H
charge: -0.248888 -0.241172 -0.005767 -0.090290 -0.365464 0.007163 0.032527 0.215449 0.354457 0.136791 0.347337 -0.384008 -0.398814 -0.415349 -0.233448 -0.775336 -0.061607 0.282544 0.241390 0.284873 0.236147 0.216700 0.249389 0.249354 0.366024
chargesum: 0.00000
title: Mulliken charges with hydrogens summed into heavy atoms:
elementType: O O N N N N C C C C C C C C C C C
charge: -0.248888 -0.241172 -0.005767 -0.090290 0.000560 0.007163 0.032527 0.215449 0.354457 0.136791 0.347337 -0.101464 -0.157423 -0.130476 0.002699 -0.059894 -0.061607
polarizability: 2.33363003e+02 -4.84337645e+00 1.79214089e+02 -1.06702718e-02 9.54393233e-03 6.32825578e+01
1716.lowfreq: -0.0005 0.0004 0.0009 2.4061 10.1519 18.2056 44.8290 58.1196 93.2803
frequency: 44.5142 58.0198 93.2802 108.7883 116.6259 155.3635 207.8265 222.1007 242.1043 282.2010 318.5038 323.3726 376.2850 475.7075 491.3303 501.1461 517.0531 539.5088 593.3033 601.9927 640.3691 672.4302 685.8910 728.3643 746.6552 760.3767 812.6363 816.4961 848.6260 866.7135 895.5891 916.6120 933.9909 944.6209 987.1277 998.0320 1009.7954 1041.5005 1049.6547 1079.6879 1117.0360 1129.4329 1155.2237 1175.9786 1187.3308 1214.0496 1268.1865 1271.5166 1334.7292 1391.5245 1397.3627 1407.4853 1411.4536 1458.8132 1460.7510 1467.5738 1478.9417 1557.7035 1590.3574 1605.5128 1629.1107 2988.0449 3068.6913 3096.6303 3132.0936 3151.0136 3169.4028 3184.1800 3600.3462
redmass: 8.8040 5.0060 6.2802 6.2137 1.0766 4.9573 4.2802 4.3354 4.8776 8.6286 6.2290 6.2263 6.3655 4.0496 8.3374 5.8112 6.3174 3.7476 6.5489 9.7455 9.6051 6.1748 3.7657 1.2533 4.4372 2.7153 5.7585 1.5826 7.1706 6.2842 1.5524 4.2105 1.3720 9.0261 8.5937 1.3423 1.8502 4.7295 1.5308 1.8503 6.9609 3.7416 4.4306 1.5239 2.2560 4.7257 1.7178 2.2909 4.9216 3.0453 1.8257 1.3793 2.9828 5.5385 1.0436 3.0224 1.2678 9.5808 7.7615 6.6262 8.4868 1.0366 1.0970 1.1008 1.0882 1.0911 1.0988 1.0929 1.0850
irintensity: 6.7113 0.3712 2.7218 0.0117 0.4642 4.7984 3.6249 0.3312 0.3425 0.6727 4.2311 8.4760 0.1172 0.4779 2.1265 1.6575 6.8853 0.0987 6.2555 0.1539 5.9836 2.4087 0.4080 108.6660 6.0798 46.5901 6.2135 40.3017 19.9149 1.7529 29.1740 14.9219 0.1923 1.3258 24.9021 0.7223 1.0172 9.3583 7.6156 45.0332 13.0803 4.1583 12.2664 11.4249 22.3256 21.8499 0.3719 2.2451 258.5792 3.5992 16.9781 15.4367 11.4281 18.5524 14.7133 36.0950 9.3434 242.8453 5.6535 25.1027 78.1687 17.1327 11.1642 19.7154 9.3083 7.8747 18.2642 1.7486 155.9603
temp: 298.150 k
press: 1.00000 atm
elementType: 8 8 7 7 7 7 6 6 6 6 6 6 6 6 6 6 6 1 1 1 1 1 1 1 1
symmnumber: 1
zpe: 465375.3 jmol-1
zpe.correction: 0.177252 hartree
zpe.thermalcorrener: 0.190679 hartree
zpe.thermalcorrenthalpy: 0.191623 hartree
zpe.thermalcorrgfe: 0.136280 hartree
zpe.sumelectzpe: -792.190485 hartree
zpe.sumelectthermal: -792.177058 hartree
zpe.sumelectthermalent: -792.176114 hartree
zpe.sumelectthermalfe: -792.231457 hartree
dipole: 1.6519 -2.2021 -0.0013
dipole: 2.7528
quadrupole: -67.0791 -112.0952 -98.5911
quadrupole: 17.9328 -0.0057 -0.0022
quadrupole: 25.5094 -19.5067 -6.0027 17.9328 -0.0057 -0.0022
hfenergy: -792.3677372 hartree
pointgroup: C01 [X(C11H8N4O2)]
dipole: 0.6550242 0.862487 0.0005195 debye
dipolederiv: -1.1426879 0.3651299 0.0000005 0.2087676 -0.6762514 -0.0000815 0.0000623 -0.0000638 -0.1196024 -0.6042782 -0.2385626 -0.0000354 -0.0930829 -1.117986 -0.0000891 -0.0000357 -0.0001594 -0.3506076 0.1022676 -0.148782 0.0000821 0.2265382 -0.3022864 0.0001906 0.0004544 -0.0000366 -0.0855793 -0.2762907 0.1883736 -0.0000616 -0.1158569 -0.0897079 0.000039 0.0000279 0.0000105 -0.1288039 -0.6578147 0.1464979 -0.0000101 -0.1204763 -0.0452319 0.000017 -0.0007503 0.0001664 -0.1701676 -0.143166 -0.3038988 -0.000032 -0.1541741 0.1660522 -0.0002586 0.0001587 -0.0001391 -0.0942286 0.7982451 -0.1103522 0.000005 -0.2508692 0.1269211 -0.0000116 -0.0000119 0.0000335 0.058545 -0.2391082 0.2734195 0.0000341 0.2940307 -0.5026856 -0.000068 0.0000257 -0.0000508 0.0025593 -0.1793154 0.1894051 -0.000015 0.1873511 0.3074815 -0.0000194 -0.0000472 -0.0002289 -0.0234121 1.1768864 0.2660369 0.0000684 -0.0883178 1.2721383 0.000128 0.0000489 0.0001893 0.1799897 0.7832399 -0.1927155 -0.0000025 -0.3186136 0.8585794 0.0001043 -0.0001821 0.0000889 0.1488396 -0.0295997 -0.0924431 0.0000023 0.1215609 0.0322956 0.0000477 0.000017 0.0000259 -0.1284658 0.0170859 -0.0883586 0.0000279 -0.0649874 0.0805161 0.0000242 0.0000374 0.0000499 -0.1599951 -0.6614076 -0.4683356 -0.000092 -0.1265527 -0.3478087 -0.0000149 -0.0000663 -0.0000617 -0.1787385 0.1437929 0.0726295 0.0000161 0.037661 -0.1666747 0. 0.0000258 0.0000168 -0.1431336 -0.0028838 -0.1719909 -0.0000844 -0.0983856 -0.0482806 0.0000711 0.0000287 0.0003827 0.0457589 0.436052 0.1546753 0.0000031 0.2721754 0.0476345 0.0000004 0.0000585 0.0000212 0.0658315 0.0998232 0.0006412 -0.0000032 -0.0822245 0.0224342 -0.0000262 -0.0000195 -0.00002 0.1589487 0.0282416 0.0828324 -0.0000059 0.1096735 -0.0513973 -0.000032 0.0000148 -0.0000504 0.1509887 0.0381831 0.0328958 0.0000051 0.0814133 0.0910276 -0.0000082 0.0000159 -0.0000137 0.1638962 -0.1240605 -0.0168767 -0.0000196 -0.0117661 0.0818187 -0.0000163 -0.0000162 -0.0000245 0.1606483 -0.0467383 0.1737659 0.0002981 0.0675167 -0.0442915 -0.0001973 0.0001613 -0.0003097 0.1111181 0.0560047 -0.0485646 -0.0977516 -0.0220318 0.0525774 0.0109962 -0.0942546 -0.0359265 -0.0212879 0.0564257 -0.0486789 0.0975627 -0.0221998 0.0523166 -0.0107996 0.0940806 0.0360975 -0.0218229 0.3711028 -0.0167437 0.0000077 -0.03715 0.2008086 0.0000044 0.0001659 0.0000027 0.3787213 unknown
polarizability: 233.4186105|4.521515|179.1584814|0.0107268|0.0094804|63.2825578 unknown
InChI: InChI=1S/C11H8N4O2/c1-6-3-2-4-7-8(16)5-9(17-10(6)7)11-12-14-15-13-11/h2-5,14H,1H3
charge 0 multiplicity 1
25 atoms
O  0.164334 0.711284 -0.000008
O  -1.328845 -3.205723 -0.000713
N  3.441401 -0.927466 -0.000104
N  2.884925 1.312396 -0.000155
N  4.531197 -0.106468 0.000421
N  4.234087 1.261023 -0.000191
C  -1.233202 0.495339 -0.000126
C  -1.77996 -0.815218 -0.000351
C  -2.02871 1.671564 -0.000007
C  -0.886952 -2.007778 -0.000452
C  1.008091 -0.397465 -0.000155
C  -3.192323 -0.956811 -0.00048
C  -3.427331 1.482337 -0.000122
C  0.547722 -1.694753 -0.000398
C  -4.010025 0.184518 -0.000368
C  -1.386552 3.043056 0.000128
C  2.419551 -0.015242 -0.000046
H  -3.601953 -1.971953 -0.000656
H  -4.074814 2.367051 -0.000016
H  1.26418 -2.520073 -0.000538
H  -5.10015 0.081677 -0.000453
H  -2.155865 3.833411 0.001658
H  -0.736211 3.180629 0.88295
H  -0.738607 3.181848 -0.884291
H  5.488609 -0.458782 0.000674
