program: Gaussian 09
title: 000214626
version: EM64L-G09RevD.01
frameworkgroup: C1[X(C11H7NO2)]
method: RPBEPBE
basis: SDD
operation: Freq
keyword: #p
keyword: freq=noraman
keyword: PBEPBE/SDD
title: #p freq=noraman PBEPBE/SDD
converged: YES YES NO YES
title: Mulliken charges:
elementType: O O N C C C C C C C C C C C H H H H H H H
charge: -0.255612 -0.228178 0.022784 0.035448 0.212940 0.358679 -0.377544 -0.393361 0.141123 -0.229385 -0.780357 -0.398959 0.338052 -0.218638 0.284175 0.244762 0.239957 0.247972 0.223305 0.247972 0.284867
chargesum: 0.00000
title: Mulliken charges with hydrogens summed into heavy atoms:
elementType: O O N C C C C C C C C C C C
charge: -0.255612 -0.228178 0.022784 0.035448 0.212940 0.358679 -0.093370 -0.148599 0.141123 0.010571 -0.061108 -0.114092 0.338052 -0.218638
polarizability: 1.86639678e+02 -8.76744823e+00 1.57526354e+02 5.52874081e-03 -3.09693322e-03 5.44902535e+01
1716.lowfreq: -11.3490 -3.2338 -0.0008 -0.0005 0.0005 2.6182 67.6996 84.8629 117.8053
frequency: 67.6976 84.8361 117.8051 120.8174 154.4920 208.3671 231.0279 271.2950 326.0222 375.5381 389.1377 455.0688 475.0962 485.8682 515.0078 534.8530 541.6990 625.6571 648.5989 682.8636 695.6630 755.2868 815.0076 815.7182 884.7173 892.4275 933.1731 935.2596 1000.0676 1006.4279 1049.8750 1071.8975 1109.7868 1151.4199 1175.8463 1188.1522 1269.9386 1271.1217 1331.3579 1394.9795 1405.6934 1412.8385 1460.6493 1467.7952 1478.4639 1556.7779 1579.7906 1603.7417 1616.3789 2193.4876 2991.0143 3070.3691 3102.2830 3136.4737 3154.5631 3172.6253 3189.1955
redmass: 3.6764 1.1466 7.3954 8.1757 5.2077 3.8377 4.3292 5.1166 5.1199 8.6266 8.9989 7.5132 3.9987 7.9631 6.6182 6.1752 3.7224 7.4947 8.1351 3.8553 6.0418 2.4474 5.8640 1.5284 6.1687 1.5611 3.3749 1.3715 1.3462 1.8838 1.5308 2.0366 5.3298 2.7225 1.5381 1.8498 1.9780 1.9923 4.9176 4.1503 1.3964 2.8652 1.0443 2.6472 1.2287 11.4453 7.2230 6.5349 8.1088 12.6245 1.0370 1.0972 1.1001 1.0884 1.0910 1.0990 1.0936
irintensity: 0.0029 0.4080 0.9867 3.3995 11.8987 0.9543 1.8150 2.8969 6.2966 1.9372 0.1749 3.2860 0.8079 2.3724 5.5278 2.5355 0.0036 2.3764 0.0087 0.0022 3.6036 24.9032 10.6205 46.5806 7.9771 32.6078 23.6006 0.2548 0.6262 2.1227 7.5164 22.7928 25.8036 2.8710 15.0870 14.8807 1.9366 4.5400 247.6616 0.5305 20.4615 6.3998 15.3568 36.5989 8.7903 81.5426 127.0324 31.1804 92.8983 1.9862 16.6488 11.4766 17.0526 8.5103 5.5788 15.3443 1.6763
temp: 298.150 k
press: 1.00000 atm
elementType: 8 8 7 6 6 6 6 6 6 6 6 6 6 6 1 1 1 1 1 1 1
symmnumber: 1
zpe: 392686.2 jmol-1
zpe.correction: 0.149566 hartree
zpe.thermalcorrener: 0.161163 hartree
zpe.thermalcorrenthalpy: 0.162107 hartree
zpe.thermalcorrgfe: 0.111685 hartree
zpe.sumelectzpe: -627.586834 hartree
zpe.sumelectthermal: -627.575237 hartree
zpe.sumelectthermalent: -627.574293 hartree
zpe.sumelectthermalfe: -627.624716 hartree
dipole: -3.9992 -2.4414 -0.0008
dipole: 4.6855
quadrupole: -82.1117 -88.4964 -81.3312
quadrupole: 8.6276 -0.0026 -0.0026
quadrupole: 1.8681 -4.5166 2.6486 8.6276 -0.0026 -0.0026
hfenergy: -627.7364003 hartree
pointgroup: C01 [X(C11H7N1O2)]
dipole: -1.5558051 -0.9887797 -0.0003216 debye
dipolederiv: -1.158826 -0.2559169 -0.0000458 -0.1086083 -0.6142592 -0.000011 -0.0001367 -0.0001306 -0.1298927 -0.5155765 0.1049643 -0.0000432 -0.0957105 -1.1298776 0.0001989 -0.0000562 -0.0003029 -0.3405644 -0.2169787 0.0497226 -0.0000129 -0.0027063 -0.1973639 0.0000028 0.0000045 -0.0000159 -0.2058759 0.7959073 -0.035698 0.0000293 0.1242918 0.0998726 -0.0000726 0.0001512 0.0001241 0.0592949 -0.3507671 -0.3177862 -0.0000289 -0.3480112 -0.4018333 -0.0000229 0.0000665 0.0000444 0.0048475 -0.2479431 -0.0796484 0.0000259 -0.0772193 0.3822368 -0.0000679 0.0000357 -0.0003097 -0.02353 -0.0407577 0.10883 -0.0000244 -0.1041147 0.0316749 -0.0000022 -0.0000105 -0.0000045 -0.1243079 0.0600095 0.0931911 -0.0000515 0.0713157 0.0518669 -0.0000116 -0.0000458 0.0000117 -0.152374 1.0357665 -0.1854228 0.0000907 0.1898209 1.2815978 -0.000114 0.0000994 0.0000643 0.1863921 0.1214203 -0.1353572 -0.0000149 -0.0940814 -0.1435021 0.0000033 -0.0000303 0.000045 -0.1365309 0.0424208 0.1449008 0.0000451 0.076816 -0.1010275 0.0000752 0.0000077 0.0004494 0.0508294 -0.4122326 0.4653094 -0.0000108 0.0386171 -0.4054436 0.0000236 -0.0001256 0.0000431 -0.1719694 0.8480626 0.3016651 0.0001028 0.443695 0.8646094 -0.0000179 0.0000967 0.0001436 0.2261538 -0.0294409 -0.1233881 0.0000103 -0.0361838 0.0190132 -0.0000178 -0.0000296 0.0000552 0.0436903 0.1110479 -0.0208653 0.0000036 0.057957 0.0153352 0.0000109 0.000024 0.0000069 0.159748 -0.0048163 -0.0891922 0.0000182 -0.1099921 -0.005873 -0.000003 0.0000037 -0.0000223 0.1511627 -0.0955731 0.0531862 0.0000116 0.0491931 0.0691133 -0.0000088 0.0000152 -0.0000253 0.1608461 0.0636011 0.044779 -0.0990885 0.0165571 0.0373858 0.0098117 -0.0824366 0.0598358 -0.0219292 -0.0839661 -0.157537 -0.0003171 -0.0531208 0.0095044 -0.0001192 -0.0002133 -0.0002572 0.1131021 0.06309 0.0448374 0.0993279 0.0165231 0.037649 -0.009661 0.082631 -0.0597443 -0.0213757 0.0155522 -0.0105737 -0.0000274 -0.0550383 0.0993209 0.0000035 -0.0000511 -0.000011 0.1722833 unknown
polarizability: 186.9467587|-8.2361224|157.2192732|0.0055838|-0.0029966|54.4902535 unknown
InChI: InChI=1S/C11H7NO2/c1-7-3-2-4-9-10(13)5-8(6-12)14-11(7)9/h2-5H,1H3
charge 0 multiplicity 1
21 atoms
O  0.80235 -0.98624 -0.000157
O  0.134096 3.153309 0.00029
N  4.218031 -1.213076 0.000466
C  -0.52529 -0.48918 -0.000206
C  -0.792949 0.905895 -0.000245
C  -1.543651 -1.478509 -0.000111
C  -2.146862 1.331608 -0.000112
C  -2.874048 -1.007252 -0.000027
C  0.319712 1.894012 -0.00053
C  -3.179124 0.381228 -0.000004
C  -1.201345 -2.953083 -0.000017
C  1.667424 1.299666 -0.000041
C  1.852226 -0.063023 -0.00002
C  3.138251 -0.70161 0.00031
H  -2.342264 2.408546 -0.000153
H  -3.688618 -1.74032 0.000026
H  -4.224883 0.704581 0.000064
H  -0.600025 -3.225387 0.886187
H  -2.117029 -3.566618 -0.001508
H  -0.597354 -3.224909 -0.884523
H  2.532455 1.96716 0.000211
