program: Gaussian 09
title: 000214613
version: EM64L-G09RevD.01
frameworkgroup: C1[X(C9H13NO)]
method: RPBEPBE
basis: SDD
operation: Freq
keyword: #p
keyword: freq=noraman
keyword: PBEPBE/SDD
title: #p freq=noraman PBEPBE/SDD
converged: NO YES NO NO
title: Mulliken charges:
elementType: O N C C C C C C C C C H H H H H H H H H H H H H
charge: -0.442058 -0.291113 -0.557309 -0.368529 0.536141 -0.538490 -0.438216 0.305561 -0.190920 -0.413004 -0.625938 0.229913 0.197343 0.221929 0.198914 0.254199 0.236797 0.251518 0.222510 0.218601 0.226502 0.191144 0.222151 0.352353
chargesum: 0.00000
title: Mulliken charges with hydrogens summed into heavy atoms:
elementType: O N C C C C C C C C C
charge: -0.089706 -0.039595 -0.130053 0.052315 0.536141 -0.284291 -0.201419 0.305561 0.031590 -0.194403 0.013859
polarizability: 1.43325772e+02 2.51649242e+00 1.07177586e+02 1.28791490e+01 -4.50114157e+00 6.93361517e+01
1716.lowfreq: -10.6474 -6.1358 -0.0003 0.0004 0.0007 6.2380 20.9046 74.4993 83.2926
frequency: 20.5608 74.4611 83.2625 102.5195 204.9849 222.7715 236.3246 271.3613 295.0353 362.1455 385.6382 424.9060 458.5475 515.7218 562.5168 611.0783 675.5499 698.0952 740.4398 781.9926 800.8458 872.5926 888.5976 923.0409 961.7396 966.9046 985.0770 1017.9502 1033.8280 1084.3222 1106.7738 1124.2991 1140.0586 1157.6442 1173.2601 1181.7428 1210.3308 1264.3303 1270.9599 1293.5705 1310.4663 1361.2917 1393.7254 1433.5747 1448.0408 1463.8077 1467.7293 1474.9950 1480.2577 1488.6259 1497.1169 1594.4984 1629.6426 2857.7237 2872.8876 2981.3951 3007.9585 3015.9316 3055.4098 3077.2748 3109.5820 3127.5850 3144.7734 3154.7029 3431.5750 3579.7925
redmass: 3.3924 3.5608 1.7740 2.5602 2.5146 3.8639 1.4181 3.8988 3.1226 1.1160 3.1011 3.0591 2.9718 7.1641 4.4824 4.2157 1.4589 2.0675 3.9424 1.5724 1.1762 1.4146 1.4983 3.1680 1.4160 1.8065 6.1943 1.8112 2.6192 1.5290 1.3190 1.7627 1.4232 2.8815 1.1650 1.4001 1.4858 2.2054 1.1979 1.7177 1.2833 1.3532 6.8034 1.1512 1.2000 1.0987 2.3953 1.1644 2.4365 1.0677 1.0710 6.4944 6.3584 1.0703 1.0570 1.0639 1.0848 1.0751 1.1005 1.0998 1.0885 1.0896 1.0922 1.0987 1.0743 1.0659
irintensity: 0.8270 0.9038 3.4732 2.5663 2.4549 0.5966 1.7723 3.3257 7.0553 141.9179 6.7846 8.8976 11.3936 1.3888 1.7505 12.0898 124.1968 15.6377 6.4566 58.1421 2.0346 3.4682 18.3175 45.2081 2.1918 9.2154 1.7600 10.3092 1.3618 31.2978 0.6441 40.0109 124.1055 21.0519 10.3240 41.3697 0.4462 36.5454 4.5738 6.9947 14.0915 10.9552 11.0550 1.6135 21.9920 15.6340 17.9975 8.8449 26.2504 14.3931 7.2978 61.8475 61.7357 68.7754 171.3450 26.3727 33.8347 49.0005 28.5135 41.3513 11.9416 15.8673 11.9424 15.8222 1.7530 31.5876
temp: 298.150 k
press: 1.00000 atm
elementType: 8 7 6 6 6 6 6 6 6 6 6 1 1 1 1 1 1 1 1 1 1 1 1 1
symmnumber: 1
zpe: 530221.7 jmol-1
zpe.correction: 0.201951 hartree
zpe.thermalcorrener: 0.213328 hartree
zpe.thermalcorrenthalpy: 0.214273 hartree
zpe.thermalcorrgfe: 0.163495 hartree
zpe.sumelectzpe: -479.874077 hartree
zpe.sumelectthermal: -479.862699 hartree
zpe.sumelectthermalent: -479.861755 hartree
zpe.sumelectthermalfe: -479.912533 hartree
dipole: -0.7498 0.0584 -0.9243
dipole: 1.1916
quadrupole: -53.4933 -66.1489 -68.8068
quadrupole: -5.8956 3.2868 -2.0604
quadrupole: 9.3230 -3.3326 -5.9905 -5.8956 3.2868 -2.0604
hfenergy: -480.0760278 hartree
pointgroup: C01 [X(C9H13N1O1)]
dipole: -0.2983663 0.0032982 0.3616196 debye
dipolederiv: -0.6693264 0.6023847 -0.0677981 0.7175457 -0.9152925 -0.1101394 -0.0642276 -0.0989786 -0.3836291 -0.821406 -0.0061382 -0.0458794 0.0599733 -0.3292653 -0.2706072 -0.1111515 -0.2305826 -0.4699299 -0.194528 -0.0476828 -0.0209866 -0.0279686 0.1487356 -0.0475929 -0.1681575 -0.0391682 0.1233403 0.6073425 -0.0439714 -0.1128388 0.0714044 0.3283009 0.0832852 -0.0289328 0.0723746 0.1699392 0.4395861 -0.0213529 -0.080879 0.0533213 0.1751289 -0.052501 -0.1502247 -0.0330925 -0.0408272 -0.366286 0.2450382 -0.0253173 0.0620702 -0.0717999 -0.0421705 0.0472837 -0.1041981 -0.1659812 -0.2794301 -0.1080628 0.0103449 -0.1437219 -0.0996718 0.0192045 0.0423104 0.0120451 -0.211801 0.6769736 -0.5861163 -0.0497978 -0.6920753 0.8564538 0.0442699 -0.0524824 0.0386489 0.1020422 0.1847339 0.027464 -0.0982611 -0.0905249 0.1305134 -0.018567 -0.0827198 -0.0582525 -0.0792887 -0.0962894 -0.0481921 -0.0562077 0.266037 -0.3394893 -0.0578796 -0.1010641 0.037305 -0.2055084 0.2912856 0.0211786 0.137883 -0.0786638 0.2816275 0.0957762 0.2817512 0.1450208 0.3833858 0.0373959 0.029327 0.0467144 0.0434435 -0.0651599 -0.1064692 0.0343428 -0.0595169 0.0165921 0.0213403 -0.0046295 0.0187366 -0.0513659 -0.0662855 0.1511529 0.0323118 0.0856439 -0.0376088 0.0337878 -0.0019683 0.0024386 -0.0140627 -0.0591899 0.1195633 0.0563821 0.093675 -0.045433 -0.1191186 0.0508136 0.0394438 0.1170423 -0.1362086 -0.1535715 0.0963641 -0.101662 -0.0536377 0.0906597 -0.0593721 0.045646 -0.0540227 -0.0268964 0.0520673 0.0401379 0.0563148 0.1291307 0.0182182 0.1152731 0.0331108 0.1038997 -0.0234984 0.0067354 0.0348237 0.0005982 0.1413817 0.1163431 0.0029015 -0.074874 -0.0495675 0.0876036 0.2273596 -0.0265327 0.1138336 0.143317 0.0538379 -0.0651655 0.0417199 -0.0706549 -0.0837755 0.0653416 0.0478902 0.0672273 0.1254291 -0.1204319 0.0125369 0.0928845 0.0337302 0.0782984 0.0099957 0.0932353 0.0168488 0.145974 0.1042678 -0.0353718 0.0135547 0.0186708 -0.091262 0.1349369 -0.0701648 0.0967203 -0.0367228 0.0065873 0.0637309 0.011995 -0.0520644 -0.1669669 -0.2048761 -0.1423728 -0.1721273 -0.1258242 -0.2100229 -0.0302823 0.0509372 -0.0465933 0.1031296 -0.0183244 0.0929876 0.0044472 0.0383018 0.1944795 -0.1123426 0.0874302 -0.1758525 0.2849702 0.0730104 0.0982097 0.0568752 0.3373581 unknown
polarizability: 143.5331715|-3.4576928|106.3934822|-12.013963|-7.0714594|69.9128561 unknown
InChI: InChI=1S/C9H13NO/c1-10-6-5-8-3-2-4-9(11)7-8/h2-4,7,10-11H,5-6H2,1H3
charge 0 multiplicity 1
24 atoms
O  -3.109561 1.894623 0.073199
N  3.652537 0.199102 -0.241119
C  1.287666 -0.135323 -0.94177
C  2.257446 0.117472 0.240322
C  -0.153882 -0.277566 -0.478833
C  -1.004863 0.849964 -0.421861
C  -0.653492 -1.5389 -0.055048
C  -2.329343 0.721404 0.051896
C  -1.978069 -1.66087 0.416634
C  -2.827866 -0.533395 0.475527
C  4.652748 0.388607 0.828849
H  1.625979 -1.048997 -1.46379
H  1.373641 0.705475 -1.659129
H  2.190705 -0.726839 0.954079
H  1.928337 1.032349 0.796171
H  -0.657376 1.836786 -0.747488
H  -0.004413 -2.421049 -0.104266
H  3.748591 0.906717 -0.983462
H  -2.358822 -2.637124 0.736757
H  -3.859432 -0.632022 0.839789
H  4.64781 -0.49478 1.49398
H  4.479817 1.289661 1.468007
H  5.661156 0.467244 0.385558
H  -4.018515 1.70106 0.412898
