program: Gaussian 09
title: 000214609
version: EM64L-G09RevD.01
frameworkgroup: C1[X(C11H16N2O2S)]
method: RPBEPBE
basis: SDD
operation: Freq
keyword: #p
keyword: freq=noraman
keyword: PBEPBE/SDD
title: #p freq=noraman PBEPBE/SDD
converged: YES YES NO NO
title: Mulliken charges:
elementType: S O O N N C C C C C C C C C C C H H H H H H H H H H H H H H H H
charge: 0.343191 -0.246026 -0.208763 -0.109673 -0.004531 -0.343708 -0.343160 -0.337737 -0.438700 -0.321955 -0.316874 -0.474020 0.282161 -0.363129 -0.494867 -0.201636 0.200115 0.201400 0.194868 0.229214 0.210051 0.194235 0.244816 0.218181 0.192034 0.216973 0.214229 0.191467 0.267940 0.263494 0.274835 0.265577
chargesum: 0.00000
title: Mulliken charges with hydrogens summed into heavy atoms:
elementType: S O O N N C C C C C C C C C C C
charge: 0.343191 -0.246026 -0.208763 -0.109673 -0.004531 0.057807 0.080922 0.066550 0.024297 0.087052 0.088821 0.057415 0.282161 -0.363129 -0.220032 0.063941
polarizability: 2.33286276e+02 -1.06604458e-01 1.51343062e+02 -2.17085890e+01 -3.50021980e+00 1.12898671e+02
1716.lowfreq: -12.2755 -6.7941 -0.0022 -0.0019 -0.0015 7.9050 11.3322 18.5884 31.1845
frequency: 10.3662 16.6727 31.0460 56.3794 85.8139 108.4477 150.5092 181.3331 201.9123 237.9849 253.5052 260.1133 317.4093 335.5911 390.6544 403.4340 445.4897 457.3499 466.0587 503.5201 576.7893 584.6565 620.2797 631.8193 677.3866 720.2139 748.3043 761.3960 792.6800 811.9763 839.1903 845.5012 862.6963 883.1504 901.1098 946.0851 952.6725 1021.9202 1027.5559 1050.4257 1052.1650 1058.1542 1073.8741 1087.2036 1105.7506 1114.8765 1134.0364 1142.8695 1175.9551 1189.9201 1214.3890 1233.9206 1261.1570 1262.4911 1275.8800 1293.8123 1295.6539 1319.4660 1329.3921 1340.5369 1352.9470 1362.6516 1370.0574 1382.4455 1416.2915 1442.2666 1443.5647 1449.0681 1452.0598 1458.6210 1472.9498 1474.5252 1480.3473 1572.6598 2862.5228 2866.0142 2877.2062 2926.0094 2951.6599 2955.8994 3002.1740 3008.1797 3024.3426 3044.1352 3050.7775 3069.8928 3080.1915 3084.9167 3201.3577 3247.0441
redmass: 5.7485 4.8033 4.1382 7.2448 4.0670 4.4051 4.0939 4.2049 3.8778 1.8672 3.4966 3.2567 2.4182 2.9030 2.4083 3.1074 5.4348 7.0336 2.8070 3.5513 2.6856 2.1462 9.1252 4.3817 7.3131 2.1328 6.3120 1.2256 2.3238 2.5912 1.6160 4.6620 2.5982 1.3460 2.4048 3.2377 2.3500 2.2520 2.1990 2.4931 1.6235 1.9088 2.3184 2.9961 2.2647 2.1001 2.0528 2.1745 1.6547 1.0753 1.4164 1.9025 1.1880 1.3809 1.4619 1.2705 1.7382 1.4377 1.3656 1.2346 1.6170 1.4304 1.2761 1.4354 5.3856 1.0922 1.0863 1.0825 1.0944 1.0925 1.6350 2.2835 1.0856 8.3557 1.0699 1.0707 1.0687 1.0686 1.0666 1.0669 1.0638 1.0872 1.0899 1.0906 1.0918 1.0965 1.0962 1.0972 1.0923 1.1006
irintensity: 0.8544 0.1473 0.1999 3.1721 2.4624 1.3458 5.5584 6.6499 5.7885 2.4346 7.4190 10.3822 14.8803 5.1143 0.0461 1.5797 6.4940 4.8214 0.4468 1.1402 25.6578 2.0896 3.4087 6.4438 2.8761 33.6949 49.9051 73.5123 18.9989 5.8115 0.7564 7.0249 21.6168 1.5173 11.8271 21.5628 61.7454 11.3535 12.4553 41.5185 3.5871 1.0465 1.7927 30.2824 2.5666 31.8335 29.6675 35.2024 42.4423 2.7242 19.1113 44.1841 15.3406 20.9945 31.7195 3.4039 2.5273 29.8000 6.1259 7.1987 50.4165 1.5240 2.5943 0.8976 85.3284 24.0317 0.9364 5.4408 14.6546 2.3778 40.8387 30.6875 28.7451 79.5839 29.1580 45.2713 321.6257 108.5562 33.2410 95.7097 31.3156 21.8729 47.7890 24.5163 6.8863 28.1933 44.7585 40.2355 6.7814 0.9595
temp: 298.150 k
press: 1.00000 atm
elementType: 16 8 8 7 7 6 6 6 6 6 6 6 6 6 6 6 1 1 1 1 1 1 1 1 1 1 1 1 1 1 1 1
symmnumber: 1
zpe: 678962.6 jmol-1
zpe.correction: 0.258603 hartree
zpe.thermalcorrener: 0.274236 hartree
zpe.thermalcorrenthalpy: 0.275180 hartree
zpe.thermalcorrgfe: 0.211632 hartree
zpe.sumelectzpe: -1085.503391 hartree
zpe.sumelectthermal: -1085.487758 hartree
zpe.sumelectthermalent: -1085.486813 hartree
zpe.sumelectthermalfe: -1085.550362 hartree
dipole: 1.9951 2.7209 0.4672
dipole: 3.4061
quadrupole: -94.7055 -103.5112 -102.7454
quadrupole: 1.9044 -12.8092 0.3163
quadrupole: 5.6152 -3.1905 -2.4247 1.9044 -12.8092 0.3163
hfenergy: -1085.7619938 hartree
pointgroup: C01 [X(C11H16N2O2S1)]
dipole: -0.7960097 0.2599344 -1.0462367 debye
polarizability: 230.8405134|-25.4364015|122.5925945|-10.6412042|-14.8366337|144.0949007 unknown
InChI: InChI=1S/C11H16N2O2S/c14-10(11-12-3-9-16-11)2-1-4-13-5-7-15-8-6-13/h3,9H,1-2,4-8H2
charge 0 multiplicity 1
32 atoms
S  -4.225994 0.315429 1.32723
O  4.659541 1.113473 0.941624
O  -1.549147 -1.12453 1.574563
N  2.507153 -0.337545 -0.371561
N  -3.093316 0.87059 -1.036618
C  1.82734 -1.458126 -1.066632
C  2.925104 -0.667705 1.017082
C  3.657034 0.206071 -1.140578
C  0.422663 -1.744846 -0.49078
C  3.515922 0.576671 1.698841
C  4.230019 1.441477 -0.427507
C  -0.470727 -0.487075 -0.535887
C  -1.616136 -0.522867 0.459543
C  -2.847776 0.227667 0.102651
C  -5.101245 1.29361 0.120956
C  -4.349899 1.470823 -1.037462
H  2.437879 -2.395399 -1.031375
H  1.733564 -1.174035 -2.13342
H  3.686196 -1.488106 1.021573
H  2.048517 -1.010699 1.595311
H  3.308899 0.492356 -2.151444
H  4.469134 -0.555039 -1.257929
H  0.489825 -2.100647 0.553254
H  -0.038355 -2.566509 -1.07169
H  2.729618 1.35705 1.791466
H  3.912636 0.331239 2.69762
H  5.132544 1.813965 -0.939857
H  3.459263 2.242103 -0.396848
H  0.177039 0.379221 -0.266689
H  -0.859965 -0.275077 -1.546702
H  -6.099557 1.670225 0.334822
H  -4.673073 2.030336 -1.91586
