program: Gaussian 09
title: 000214585
version: EM64L-G09RevD.01
frameworkgroup: C1[X(C15H22N2O4)]
method: RPBEPBE
basis: SDD
operation: Freq
keyword: #p
keyword: freq=noraman
keyword: PBEPBE/SDD
title: #p freq=noraman PBEPBE/SDD
converged: YES YES NO NO
title: Mulliken charges:
elementType: O O O O N N C C C C C C C C C C C C C C C H H H H H H H H H H H H H H H H H H H H H H
charge: -0.245371 -0.238775 -0.230614 -0.292159 -0.190074 -0.179667 -0.060714 -0.075457 -0.378429 -0.404380 -0.417403 -0.731243 0.153061 -0.216134 0.013688 0.249860 -0.506131 0.196006 -0.675467 -0.258603 -0.671065 0.270509 0.272425 0.237543 0.210299 0.228914 0.202580 0.206721 0.223605 0.226961 0.212112 0.239232 0.300610 0.240588 0.251762 0.216912 0.233036 0.231880 0.229558 0.231296 0.216106 0.246720 0.229705
chargesum: 0.00000
title: Mulliken charges with hydrogens summed into heavy atoms:
elementType: O O O O N N C C C C C C C C C C C C C C C
charge: -0.245371 -0.238775 -0.230614 -0.292159 -0.190074 -0.179667 0.209794 0.196967 0.069413 0.027114 0.012923 -0.052939 0.153061 0.084476 0.013688 0.249860 -0.013781 0.196006 0.006361 0.202251 0.021465
polarizability: 2.52612261e+02 -1.51715121e+01 2.06204912e+02 -5.96040593e+00 2.98777661e+00 1.32400642e+02
1716.lowfreq: -9.2954 -3.8358 -0.0008 -0.0008 -0.0006 7.1937 17.9443 31.9189 45.5509
frequency: 17.3957 31.7434 45.4724 62.7947 68.3571 71.9502 88.5944 99.4803 103.0655 124.6280 153.0376 187.6330 199.2301 202.4037 222.8389 241.2625 245.8205 260.5505 280.0408 288.6068 317.1382 326.5215 340.9186 374.4330 387.0299 412.7800 437.7310 457.0735 465.2139 528.3039 538.5874 577.2263 597.7305 623.6646 649.7639 679.7956 703.4800 748.1824 759.2837 770.6964 809.5203 811.3695 821.5188 834.7141 860.0602 881.1542 891.3927 902.4615 942.9819 963.0020 979.9398 1003.5463 1015.1004 1017.9053 1044.4682 1071.0768 1079.9473 1085.6214 1094.5301 1095.9990 1101.4326 1135.4930 1152.8911 1157.0443 1165.7737 1186.2645 1212.0127 1238.0203 1259.8586 1261.6326 1276.0744 1280.1767 1305.4058 1320.5960 1326.3757 1334.6006 1340.5990 1349.4015 1357.8502 1359.7298 1367.1012 1386.9494 1389.4219 1394.9921 1397.9791 1409.4059 1448.3625 1455.1934 1456.7295 1462.2028 1462.7676 1469.4456 1472.0058 1478.0296 1478.8948 1485.1701 1486.1186 1565.9657 1568.8491 1600.5427 1638.2151 2975.8241 2983.3275 2984.8139 2989.1776 2991.8142 2993.5842 3003.1273 3027.0299 3031.0772 3036.7574 3042.1883 3044.7292 3052.0532 3069.9441 3078.9796 3087.1617 3092.0830 3094.4192 3100.8923 3108.9628 3120.8263 3172.8262
redmass: 3.8320 4.0442 3.2465 4.4024 4.5729 6.5776 2.1575 4.1704 3.0558 3.3701 2.7244 1.7302 1.3203 1.1809 1.6160 2.8863 3.0575 4.4587 4.3572 2.3265 4.2289 3.7191 4.2200 7.4078 4.7062 3.0855 3.6738 3.6681 3.6975 2.7299 3.9097 3.3141 3.5928 4.8041 3.1656 7.9324 3.9755 4.4912 7.0733 2.5570 1.5456 1.3801 2.5790 2.7390 1.9984 2.4089 2.8679 2.5496 1.4233 2.0014 2.1675 2.1046 2.4043 1.7830 1.8483 2.3734 1.6020 2.5417 2.1027 1.5321 3.1649 2.3731 3.1768 1.7904 2.6972 1.6109 2.2021 2.5968 1.3213 1.1722 1.1415 2.2849 1.5826 1.2947 1.7982 1.4255 1.6276 1.5589 1.4728 1.4171 1.5722 1.2369 1.2337 2.8039 1.2126 1.6526 1.1114 1.1194 1.0915 1.0766 1.0437 1.0388 1.0767 1.0638 1.0533 1.0526 1.0590 8.6427 9.4566 8.8670 7.8595 1.0608 1.0504 1.0528 1.0578 1.0359 1.0618 1.0361 1.0986 1.0596 1.0854 1.0973 1.0866 1.1022 1.1027 1.0970 1.0971 1.0999 1.1027 1.1005 1.1004 1.1065 1.0921
irintensity: 1.3715 1.1165 0.4803 0.7538 0.2301 2.8727 4.0076 3.2557 1.9956 0.8627 0.8282 2.8139 0.6024 1.1281 2.8496 0.4768 0.4710 5.3906 8.1594 8.9452 5.4354 13.0612 5.1729 0.5099 7.0292 0.5876 6.5692 5.9362 7.4495 3.8970 7.5734 5.6962 1.8003 9.3110 3.8947 1.4345 11.4617 2.5307 29.2758 1.0699 5.3582 11.6058 5.5140 18.4690 3.8264 8.0344 22.3555 9.3104 20.9532 2.8063 3.5989 19.9381 67.3631 2.8740 8.9110 22.2757 0.4359 29.6650 51.7096 16.6412 79.0588 43.3323 210.7452 106.0580 322.1399 97.8554 372.4906 84.3674 20.5302 1.8058 4.2612 82.4790 0.5063 1.0670 12.9059 8.0195 26.3872 38.1053 18.0206 3.6104 5.2078 22.0965 20.6467 80.2764 35.3534 4.0120 26.7570 34.4099 4.9528 7.1820 13.4537 13.2720 11.6374 23.0465 13.8385 15.5296 4.6227 342.4383 35.1902 460.5568 180.1261 18.2791 10.6084 38.0403 29.0569 23.5032 15.0459 29.2246 5.6218 34.0030 10.3062 34.8810 8.3495 40.5074 24.2617 38.4441 42.0634 23.2244 1.2554 22.9843 25.9164 29.9309 0.4169
temp: 298.150 k
press: 1.00000 atm
elementType: 8 8 8 8 7 7 6 6 6 6 6 6 6 6 6 6 6 6 6 6 6 1 1 1 1 1 1 1 1 1 1 1 1 1 1 1 1 1 1 1 1 1 1
symmnumber: 1
zpe: 932931.4 jmol-1
zpe.correction: 0.355335 hartree
zpe.thermalcorrener: 0.377043 hartree
zpe.thermalcorrenthalpy: 0.377987 hartree
zpe.thermalcorrgfe: 0.303209 hartree
zpe.sumelectzpe: -993.607189 hartree
zpe.sumelectthermal: -993.585481 hartree
zpe.sumelectthermalent: -993.584536 hartree
zpe.sumelectthermalfe: -993.659315 hartree
dipole: -1.3846 0.6823 1.8962
dipole: 2.4450
quadrupole: -125.7013 -120.1705 -123.6579
quadrupole: 5.5500 4.2346 -3.0441
quadrupole: -2.5247 3.0061 -0.4813 5.5500 4.2346 -3.0441
hfenergy: -993.9625237 hartree
pointgroup: C01 [X(C15H22N2O4)]
dipole: -0.5921005 0.1287007 0.7471281 debye
polarizability: 255.9998103|-8.2587766|202.1410673|-4.2661764|8.16718|133.0769374 unknown
InChI: InChI=1S/C15H22N2O4/c1-4-13(18)16-9-11(15(20)21-5-2)14(19)17-10(3)7-6-8-12(16)17/h9-10,12H,4-8H2,1-3H3
charge 0 multiplicity 1
43 atoms
O  1.80188 -1.84004 -1.111525
O  -3.555322 1.082145 0.154602
O  3.507166 0.118307 -0.108661
O  2.60083 2.264651 -0.067883
N  -0.459404 -1.462624 -0.67999
N  -1.266957 0.734586 0.007217
C  -1.525015 -0.733204 0.0376
C  -0.764053 -2.914336 -0.88211
C  -1.685287 -1.286197 1.47636
C  -0.976588 -3.562249 0.518507
C  -2.012965 -2.799708 1.384329
C  -1.9378 -3.130745 -1.860436
C  0.893345 -1.062584 -0.688099
C  0.043278 1.182129 -0.023845
C  1.118424 0.353509 -0.262248
C  -2.402882 1.592187 0.082383
C  -2.149737 3.100091 0.065004
C  2.452174 1.010879 -0.152926
C  -3.463212 3.902464 0.074487
C  4.874874 0.712013 0.015988
C  5.230704 0.94313 1.487744
H  -2.480369 -0.884925 -0.494657
H  0.153178 -3.332357 -1.331765
H  -2.498723 -0.744798 1.991698
H  -0.744397 -1.12476 2.037886
H  0.000242 -3.572403 1.040067
H  -1.290108 -4.616027 0.391605
H  -3.028918 -2.922765 0.958562
H  -2.04515 -3.236905 2.399448
H  -2.030292 -4.208173 -2.086702
H  -2.91131 -2.794259 -1.459554
H  -1.750875 -2.596371 -2.808029
H  0.230119 2.243823 0.155814
H  -1.532941 3.374256 0.945235
H  -1.5458 3.361979 -0.825856
H  -3.245215 4.984796 0.07784
H  -4.06892 3.660761 0.963597
H  -4.075347 3.669455 -0.812788
H  5.521313 -0.046884 -0.45223
H  4.907082 1.654457 -0.558058
H  6.280567 1.281697 1.568248
H  4.58301 1.718122 1.930566
H  5.124101 0.009674 2.066879
