program: Gaussian 09
title: 000214562
version: EM64L-G09RevD.01
frameworkgroup: C1[X(C11H10N2O3)]
method: RPBEPBE
basis: SDD
operation: Freq
keyword: #p
keyword: freq=noraman
keyword: PBEPBE/SDD
title: #p freq=noraman PBEPBE/SDD
converged: NO YES NO NO
title: Mulliken charges:
elementType: O O O N N C C C C C C C C C C C H H H H H H H H H H
charge: -0.196660 -0.243375 -0.274322 -0.300335 -0.030559 0.413851 0.142513 0.172568 0.026949 -0.370747 -0.291672 -0.724179 -0.149275 -0.382530 0.198144 -0.505510 0.239216 0.277680 0.268878 0.206890 0.269218 0.250740 0.287481 0.239764 0.235472 0.239799
chargesum: 0.00000
title: Mulliken charges with hydrogens summed into heavy atoms:
elementType: O O O N N C C C C C C C C C C C
charge: -0.196660 -0.243375 -0.274322 -0.300335 -0.030559 0.413851 0.142513 0.172568 0.026949 -0.131530 -0.013992 0.020807 0.101465 -0.095050 0.198144 0.209526
polarizability: 2.42010405e+02 2.87408659e+00 1.62322487e+02 8.85737445e-02 2.89307843e-03 6.43786172e+01
1716.lowfreq: -43.3795 -0.0006 -0.0004 0.0005 2.0900 5.5284 9.4195 21.3115 57.4316
frequency: -43.3626 21.0287 57.4211 102.4191 123.9278 136.5047 184.5320 241.7064 261.9725 268.5695 289.5824 293.2111 341.4064 354.8082 418.8986 453.5873 472.3262 477.1736 524.2261 559.0848 582.1722 620.1315 663.4784 673.6719 732.8463 738.2286 778.2117 785.8696 808.1696 817.7869 900.4235 915.0457 959.0224 979.4568 996.8251 998.5825 1036.2740 1046.0498 1083.2263 1102.2423 1110.7865 1146.1487 1163.3599 1225.0731 1237.0742 1271.8720 1284.4225 1332.5848 1377.8054 1408.6148 1417.6648 1421.5268 1448.7222 1450.5729 1456.3581 1461.2851 1485.6276 1510.4223 1576.9291 1586.4586 1625.9252 1670.9503 3002.8961 3007.7709 3103.4362 3103.7731 3108.4682 3150.5063 3155.0679 3157.7495 3179.2551 3199.2362
redmass: 6.2705 5.1190 4.9708 1.1212 4.2835 3.6269 3.4062 4.1671 4.7817 1.1019 7.1571 6.6222 7.4122 5.0073 6.9697 3.7726 4.2738 3.6470 6.4475 6.0665 8.4243 3.7661 7.1213 6.9895 4.8227 6.5258 3.6941 6.6006 1.6727 7.0024 1.3740 7.3409 2.9235 1.4332 6.1748 1.3299 2.2159 1.5491 3.8523 1.9291 1.2641 1.5147 1.3367 2.6913 3.1433 2.3300 5.0543 1.9670 2.3080 1.3600 1.8174 1.4905 1.0466 1.0507 1.7650 1.0587 2.0114 4.4380 7.6728 8.9464 6.1037 11.7284 1.0295 1.0374 1.1043 1.1002 1.0968 1.1046 1.0927 1.0890 1.0944 1.0980
irintensity: 4.4663 1.4345 0.2792 0.2890 2.5582 2.3040 0.0174 1.3823 9.0282 1.1927 1.2849 12.9261 12.7377 3.9938 0.1097 1.3927 0.0624 0.2552 4.4311 3.9159 2.0984 0.1057 6.1579 0.0614 22.8842 2.9692 0.0089 0.2962 68.8036 20.9873 1.9844 2.2459 17.6351 10.1503 37.4330 0.5825 5.3768 9.9974 154.4922 77.9108 0.0501 77.1608 16.3184 12.9124 47.8601 41.0037 234.9834 63.0960 0.9015 32.7413 21.6387 30.7021 13.7053 12.9546 98.6097 9.6966 342.3266 317.6920 71.7291 120.8401 59.8495 391.6474 44.2770 19.4845 28.3411 24.7230 3.0464 14.5410 0.4310 8.2580 7.7836 2.3310
temp: 298.150 k
press: 1.00000 atm
elementType: 8 8 8 7 7 6 6 6 6 6 6 6 6 6 6 6 1 1 1 1 1 1 1 1 1 1
symmnumber: 1
zpe: 506250.3 jmol-1
zpe.correction: 0.192821 hartree
zpe.thermalcorrener: 0.206156 hartree
zpe.thermalcorrenthalpy: 0.207100 hartree
zpe.thermalcorrgfe: 0.151943 hartree
zpe.sumelectzpe: -759.201436 hartree
zpe.sumelectthermal: -759.188101 hartree
zpe.sumelectthermalent: -759.187156 hartree
zpe.sumelectthermalfe: -759.242313 hartree
dipole: 4.7334 2.2624 0.0021
dipole: 5.2463
quadrupole: -70.4367 -97.3222 -92.9809
quadrupole: -3.9313 -0.0013 -0.0123
quadrupole: 16.4766 -10.4089 -6.0677 -3.9313 -0.0013 -0.0123
hfenergy: -759.3942563 hartree
pointgroup: C01 [X(C11H10N2O3)]
dipole: 1.8624549 0.8886159 -0.044383 debye
dipolederiv: -0.4227713 0.06455 0.0030667 0.2510106 -1.0973086 -0.0046419 0.0035955 -0.002252 -0.2865545 -1.1022014 0.3410804 0.0207434 0.8975718 -0.8652654 -0.0220683 0.0226395 -0.0097837 -0.2732118 -1.0828886 -0.3188374 0.0171591 -0.2176226 -0.7843568 0.0041298 0.0195339 0.0087501 -0.3388015 -0.3527667 0.4167738 0.0075662 -0.1563396 -0.547244 0.0042371 0.007817 -0.0089981 -0.0028248 -1.8476297 -0.0751018 0.0362802 -0.4501069 -0.4872256 0.0103482 0.0353554 0.0013379 -0.2740828 -0.0900492 -0.3990065 0.0048554 0.1533364 0.4563074 -0.0050569 0.0031056 0.0072813 0.0671486 1.1512205 0.361656 -0.0232403 0.8086464 0.394644 -0.0187057 -0.0225087 -0.0078308 0.1324217 0.6329344 -0.2089465 -0.0099999 -0.4484643 1.3457077 0.0094384 -0.0103397 0.0056804 0.2044731 -0.997811 -0.2386782 0.0214771 0.7965469 -0.6282017 -0.0181932 0.0200146 0.0055211 -0.1053287 0.1319249 0.5093398 -0.0085939 -0.2976742 -0.3132354 0.0072437 -0.0065965 -0.010718 -0.1916636 -0.7849193 -0.2998476 0.0149334 -0.1519752 -0.0035535 0.0032916 0.01399 0.0063472 -0.1574584 0.112527 0.2452691 -0.0031766 0.0541944 -0.2345919 -0.0008181 -0.0024609 -0.0054552 0.0092651 0.3203799 -0.0490828 -0.0085536 0.4584721 0.3790517 -0.0115352 -0.0093805 -0.0000687 -0.0725474 1.2456826 -0.0966562 -0.0277328 -0.7808455 0.4815057 0.0178287 -0.0269977 0.0022866 0.0192794 2.2914642 0.0906248 -0.0486844 -0.5813659 1.2611304 0.0155527 -0.0506891 -0.0021306 0.2564702 0.6925998 -0.1882936 -0.0105317 -0.1982404 0.3003461 0.0048927 -0.0109351 0.004943 0.2804589 0.0319981 -0.0653004 0.0030258 -0.107248 -0.017609 0.0028583 0.0031871 0.0020631 0.1605782 0.0933036 -0.0078412 0.0016523 0.0338312 0.0079787 -0.0004445 0.0013871 0.0004205 0.1687082 0.0856775 0.0093715 -0.0759645 0.0040647 0.067939 0.0110426 -0.0602816 0.0236073 0.0088762 -0.1372819 -0.1876868 0.006298 -0.0504161 0.022353 0.0015356 0.0058933 0.0049142 0.10725 0.0923147 0.0090273 0.0718184 0.0041076 0.0680838 -0.0116856 0.0562574 -0.0240666 0.003409 -0.0707631 0.0559879 0.0047943 0.0499157 0.0920666 -0.0009359 0.0048384 -0.0010962 0.153986 0.0857363 -0.072082 0.0009301 -0.0717641 0.0786199 0.0016489 0.0006291 0.001929 0.1292424 -0.0688081 0.0427192 -0.0422942 -0.0540891 0.0645886 -0.0924492 -0.0819258 -0.0515911 -0.056256 0.0523804 0.0156673 0.001708 0.1037995 -0.1059429 -0.0028477 0.0018533 -0.0006805 0.1194805 -0.0622535 0.0452939 0.0424635 -0.0493455 0.0642123 0.095334 0.0820184 0.0495896 -0.0623179 unknown
polarizability: 241.9192299|2.8065736|162.3177814|-4.1239235|-0.1799343|64.4744982 unknown
InChI: InChI=1S/C11H10N2O3/c1-7-4-3-5-9-12-6-8(11(15)16-2)10(14)13(7)9/h3-6H,1-2H3
charge 0 multiplicity 1
26 atoms
O  -0.638336 1.865174 0.060678
O  -3.200827 0.938991 0.12366
O  -3.50879 -1.364269 0.131188
N  1.129667 0.246113 0.019046
N  0.562968 -2.144872 0.034904
C  2.140426 1.238364 -0.005776
C  1.482119 -1.138332 0.013629
C  -0.349585 0.645681 0.052404
C  -1.250151 -0.491839 0.074429
C  3.478863 0.832395 -0.034191
C  2.861303 -1.508635 -0.015581
C  1.846887 2.725239 -0.003692
C  3.854864 -0.53993 -0.039107
C  -0.748524 -1.810058 0.063866
C  -2.732119 -0.369147 0.109608
C  -4.677005 1.073564 0.162149
H  4.243913 1.612002 -0.053028
H  3.064255 -2.581234 -0.017992
H  1.239432 3.034124 -0.868735
H  2.810867 3.261939 -0.027998
H  1.280625 3.040008 0.886803
H  4.911954 -0.821269 -0.061521
H  -1.469014 -2.634252 0.080756
H  -5.12923 0.598727 -0.724902
H  -4.85147 2.158309 0.167936
H  -5.082689 0.596708 1.070367
