program: Gaussian 09
title: 000214530
version: EM64L-G09RevD.01
frameworkgroup: C1[X(C10H12N2OS)]
method: RPBEPBE
basis: SDD
operation: Freq
keyword: #p
keyword: freq=noraman
keyword: PBEPBE/SDD
title: #p freq=noraman PBEPBE/SDD
converged: YES YES NO NO
title: Mulliken charges:
elementType: S O N N C C C C C C C C C C H H H H H H H H H H H H
charge: 0.339758 -0.300330 -0.392310 -0.437465 0.361348 0.195237 -0.349094 -0.362703 -0.274913 -0.346959 -0.257103 -0.243370 -0.223784 -0.490740 0.231466 0.246610 0.327826 0.197977 0.205895 0.222037 0.243965 0.228698 0.230680 0.205087 0.234541 0.207646
chargesum: 0.00000
title: Mulliken charges with hydrogens summed into heavy atoms:
elementType: S O N N C C C C C C C C C C
charge: 0.339758 -0.300330 -0.064485 -0.437465 0.361348 0.195237 0.128983 -0.362703 0.128959 -0.124922 -0.013139 -0.014672 0.006896 0.156534
polarizability: 1.91328520e+02 -5.00787270e+00 1.65469768e+02 -3.06466120e+00 -6.18903652e-01 6.97258950e+01
1716.lowfreq: -6.3020 -2.6531 -0.5816 0.0016 0.0018 0.0028 22.6554 50.5779 72.8174
frequency: 22.2726 50.5138 72.8123 94.6120 132.1522 155.4052 197.8870 211.6503 243.1969 254.1291 272.3963 328.9103 399.0678 417.9825 475.0154 485.3071 488.2670 530.9894 547.8368 573.5704 637.6403 684.1904 701.2990 726.6871 766.5915 783.9766 842.9654 855.4702 907.3437 941.3250 982.8091 999.6426 1020.9141 1034.7899 1062.8110 1083.9675 1095.6881 1120.2543 1131.7979 1149.5004 1168.8698 1180.4271 1209.7996 1234.2324 1261.5049 1312.9023 1357.6013 1378.2447 1392.4819 1420.2606 1437.7741 1442.9923 1458.5070 1465.6808 1468.7709 1474.6479 1482.4423 1536.6074 1576.8680 1598.2407 2929.7110 2939.7760 2963.5268 2998.9495 3007.9607 3065.0078 3105.4929 3122.0218 3136.6653 3153.2304 3168.3600 3561.3236
redmass: 4.3090 3.8898 2.6311 3.1259 3.5946 4.5580 3.9691 1.6964 2.9935 4.5577 2.9346 3.1975 5.8741 2.9197 3.7614 4.3367 9.1604 1.2083 6.1626 4.6478 5.0329 6.6614 7.6184 2.4502 1.7481 2.2605 5.0921 1.3637 2.4649 1.3875 1.3214 2.8136 2.5551 4.9715 4.1194 1.9857 2.8147 1.3862 1.5777 1.4817 1.4622 1.4490 1.2175 1.3680 1.4469 1.6191 1.4728 1.5339 7.5952 2.1518 1.2188 2.1841 1.0542 1.1236 1.6895 1.1467 1.1242 5.6947 6.8970 6.4996 1.0384 1.0511 1.0716 1.1034 1.1031 1.0937 1.0979 1.0877 1.0878 1.0941 1.1003 1.0769
irintensity: 0.3061 1.7986 5.1491 7.5989 0.7052 0.5860 0.3041 3.8242 3.9913 3.7933 1.9547 2.4012 2.3792 0.7554 8.0178 2.2956 0.6939 139.5599 8.3576 3.4425 11.5380 9.7606 5.3578 39.1787 57.9183 8.0121 7.7053 0.2309 0.7187 1.0279 0.0350 15.3808 12.0558 6.8942 133.5617 1.0017 7.2038 2.1990 2.5105 41.1232 3.4548 5.9069 8.8353 30.2867 5.5112 16.1696 13.1621 2.8598 15.0678 17.0462 9.1639 26.9150 11.2849 29.3091 6.9114 28.1461 9.5793 409.3670 17.1383 32.6860 56.8393 104.7912 20.4422 120.3298 54.2240 11.9803 26.9877 5.7515 5.3749 18.6830 25.0982 75.3728
temp: 298.150 k
press: 1.00000 atm
elementType: 16 8 7 7 6 6 6 6 6 6 6 6 6 6 1 1 1 1 1 1 1 1 1 1 1 1
symmnumber: 1
zpe: 535296.1 jmol-1
zpe.correction: 0.203884 hartree
zpe.thermalcorrener: 0.217431 hartree
zpe.thermalcorrenthalpy: 0.218376 hartree
zpe.thermalcorrgfe: 0.162075 hartree
zpe.sumelectzpe: -969.989756 hartree
zpe.sumelectthermal: -969.976208 hartree
zpe.sumelectthermalent: -969.975263 hartree
zpe.sumelectthermalfe: -970.031565 hartree
dipole: 2.6118 3.2681 0.9383
dipole: 4.2875
quadrupole: -64.9735 -88.6359 -94.7130
quadrupole: -3.1484 3.6543 -0.0544
quadrupole: 17.8006 -5.8618 -11.9388 -3.1484 3.6543 -0.0544
hfenergy: -970.193639 hartree
pointgroup: C01 [X(C10H12N2O1S1)]
dipole: -0.9075578 -1.4010018 0.242719 debye
dipolederiv: -0.2554431 -0.0795347 -0.0246493 0.1741598 -0.1884621 -0.018629 -0.0295917 -0.0426268 0.0966835 -0.8151786 -0.2640572 -0.0261462 -0.4196793 -0.8027961 -0.0333449 -0.0766242 -0.0875417 -0.4512245 -1.6073145 -0.2034588 -0.036516 -0.3659386 -0.3973031 0.0884409 0.1514438 0.1151059 -0.4194383 -0.004699 0.3504888 0.0602583 -0.589344 -0.4851627 -0.026224 0.0038037 0.0160075 -0.341928 -0.3395274 -0.250104 -0.0381346 0.2204928 -0.1946619 -0.016869 0.0052735 -0.0389204 0.0565469 1.6065202 0.225694 0.049 0.7456608 0.2322072 0.0021421 0.1236365 -0.0067788 0.1406873 0.5801831 -0.1451863 0.0641137 -0.435115 0.1538051 -0.0907321 -0.0453097 -0.0934153 0.3009851 -0.1961584 -0.1231903 -0.0157465 -0.1316373 0.6347593 0.0705253 -0.016814 0.0772675 -0.1132093 0.3738521 -0.0039717 0.0937402 0.1668903 0.6106548 0.1034293 0.1499049 0.1891795 0.4123428 0.1323925 0.0452201 0.0159137 -0.134232 0.0375765 0.012484 -0.0004127 0.0245859 -0.1400414 0.1132738 0.1358043 0.0253654 0.1338803 -0.2223992 -0.0054222 0.0248475 -0.0084102 -0.1075947 -0.2242333 -0.0470279 -0.0053402 0.0312712 0.0586601 0.0236605 -0.0005026 0.0177963 -0.1755913 0.0979956 0.0500222 0.0183027 0.0323988 0.1023589 0.0274802 0.0168906 0.0296063 -0.1498311 0.633543 0.2299669 0.0195402 0.2369664 0.4447181 -0.0710277 -0.0819426 -0.1410582 0.3033304 -0.1053715 0.0151018 -0.0266913 0.141447 0.0490532 0.0649512 -0.0889457 0.1073668 -0.1275877 0.0810321 -0.061198 -0.0280508 0.0424682 0.0042857 -0.0635998 -0.00095 -0.0672321 0.031521 0.3223165 0.0728364 -0.0123837 0.1582829 0.1589984 -0.0389724 -0.0538545 -0.0727937 0.2923804 -0.2096212 0.1402305 -0.0014445 0.0565322 -0.0762089 -0.0285586 -0.0702486 -0.0167593 0.0484862 0.0807151 0.0025298 -0.0305821 -0.0545553 -0.0347925 0.086994 -0.02485 -0.0168708 -0.2012832 -0.063659 -0.1002489 -0.0224021 -0.0675202 0.0414411 -0.0134265 -0.0179199 -0.0148492 0.1511312 -0.0268912 -0.0452007 -0.0142365 -0.1005601 0.039318 -0.0176642 -0.0207774 -0.0151941 0.1611641 0.0810477 0.0072262 -0.0032066 0.0268672 -0.1249606 -0.0279869 -0.0017833 -0.0276125 0.1625033 -0.0816941 0.0931577 -0.0025913 0.1051588 0.0346622 -0.0074645 -0.0016234 -0.0076783 0.158767 0.0008745 -0.0386929 -0.053686 -0.0417314 0.0187545 0.0561174 0.048752 0.1559006 -0.1849462 0.0716856 -0.0127038 0.0183782 -0.069108 -0.0795892 -0.1049964 -0.0102644 -0.1241474 0.0199601 -0.2456404 0.0062965 -0.0228048 0.1369445 -0.0149168 0.0286932 0.0178621 0.0490724 0.0761866 unknown
polarizability: 191.9682753|-2.8877602|163.9289635|3.8176779|8.9369583|70.6269444 unknown
InChI: InChI=1S/C10H12N2OS/c1-13-7-6-11-10-8-4-2-3-5-9(8)14-12-10/h2-5,11H,6-7H2,1H3
charge 0 multiplicity 1
26 atoms
S  1.975338 2.377919 0.335426
O  -3.837611 -0.812574 -0.380517
N  -1.335228 0.280325 -0.022319
N  0.171536 2.093607 0.192446
C  1.128061 -0.124291 0.031584
C  -0.045593 0.763899 0.059923
C  -2.504258 1.163488 -0.055243
C  2.340827 0.612257 0.170376
C  -3.730475 0.400882 0.446265
C  1.178456 -1.534293 -0.104955
C  3.596947 -0.031866 0.172317
C  2.42781 -2.184231 -0.106741
C  3.629336 -1.43544 0.030654
C  -4.950486 -1.670119 0.021126
H  -2.690971 1.542013 -1.08185
H  -2.30446 2.04009 0.585738
H  -1.50521 -0.686459 -0.303216
H  -4.644389 1.023787 0.338557
H  -3.606495 0.117395 1.514144
H  0.257363 -2.120999 -0.205034
H  4.525315 0.538028 0.27938
H  2.476521 -3.273049 -0.212513
H  4.594214 -1.954343 0.027738
H  -4.841146 -2.012841 1.072157
H  -4.932282 -2.540797 -0.652959
H  -5.922821 -1.144588 -0.084285
